BDBM130048 US8815927, SM-1259
SMILES: CN[C@@H](C)C(=O)N[C@H]1CN(CC[C@H]2CC[C@H](N2C1=O)c1nc2c(cccc2[nH]1)-c1ccccc1)C(=O)CCCCOCCCCC(=O)N1CC[C@H]2CC[C@H](N2C(=O)[C@H](C1)NC(=O)[C@H](C)NC)c1nc2c(cccc2[nH]1)-c1ccccc1
InChI Key: InChIKey=ZPYWWTKXCOYJBE-LLUFGHGUSA-N
Data: 2 IC50
Activity Spreadsheet -- Enzyme Inhibition Constant Data from BindingDB
Found 2 hits for monomerid = 130048
Trg + Lig
Ki
nM
ΔG°
kcal/mole
IC50
nM
Kd
nM
EC50/IC50
nM
koff
s-1
kon
M-1s-1
pHTemp
°C
Baculoviral IAP repeat-containing protein 3 (IAP1 BIR3)
(Homo sapiens (Human))
BDBM130048
(US8815927, SM-1259)
Show SMILES CN[C@@H](C)C(=O)N[C@H]1CN(CC[C@H]2CC[C@H](N2C1=O)c1nc2c(cccc2[nH]1)-c1ccccc1)C(=O)CCCCOCCCCC(=O)N1CC[C@H]2CC[C@H](N2C(=O)[C@H](C1)NC(=O)[C@H](C)NC)c1nc2c(cccc2[nH]1)-c1ccccc1 |r|
Show InChI InChI=1S/C62H78N12O7/c1-39(63-3)59(77)67-49-37-71(33-31-43-27-29-51(73(43)61(49)79)57-65-47-23-15-21-45(55(47)69-57)41-17-7-5-8-18-41)53(75)25-11-13-35-81-36-14-12-26-54(76)72-34-32-44-28-30-52(74(44)62(80)50(38-72)68-60(78)40(2)64-4)58-66-48-24-16-22-46(56(48)70-58)42-19-9-6-10-20-42/h5-10,15-24,39-40,43-44,49-52,63-64H,11-14,25-38H2,1-4H3,(H,65,69)(H,66,70)(H,67,77)(H,68,78)/t39-,40-,43+,44+,49-,50-,51-,52-/m0/s1
US Patent
n/an/a<10n/an/an/an/an/an/a
The Regents of the University of Michigan
US Patent
Assay Description
An in vitro fluorescence polarization (FP) based binding assay was used to test the binding ability of the compounds of the present invention to cert...
US Patent US8815927 (2014)
BindingDB Entry DOI: 10.7270/Q25X27M6
cIAP-2 BIR3
(Homo sapiens (Human))
BDBM130048
(US8815927, SM-1259)
Show SMILES CN[C@@H](C)C(=O)N[C@H]1CN(CC[C@H]2CC[C@H](N2C1=O)c1nc2c(cccc2[nH]1)-c1ccccc1)C(=O)CCCCOCCCCC(=O)N1CC[C@H]2CC[C@H](N2C(=O)[C@H](C1)NC(=O)[C@H](C)NC)c1nc2c(cccc2[nH]1)-c1ccccc1 |r|
Show InChI InChI=1S/C62H78N12O7/c1-39(63-3)59(77)67-49-37-71(33-31-43-27-29-51(73(43)61(49)79)57-65-47-23-15-21-45(55(47)69-57)41-17-7-5-8-18-41)53(75)25-11-13-35-81-36-14-12-26-54(76)72-34-32-44-28-30-52(74(44)62(80)50(38-72)68-60(78)40(2)64-4)58-66-48-24-16-22-46(56(48)70-58)42-19-9-6-10-20-42/h5-10,15-24,39-40,43-44,49-52,63-64H,11-14,25-38H2,1-4H3,(H,65,69)(H,66,70)(H,67,77)(H,68,78)/t39-,40-,43+,44+,49-,50-,51-,52-/m0/s1
US Patent
n/an/a<20n/an/an/an/an/an/a
The Regents of the University of Michigan
US Patent
Assay Description
An in vitro fluorescence polarization (FP) based binding assay was used to test the binding ability of the compounds of the present invention to cert...
US Patent US8815927 (2014)
BindingDB Entry DOI: 10.7270/Q25X27M6