BDBM13390 4-{[(4-cyanophenyl)(1-methyl-1H-imidazol-5-yl)methoxy]methyl}-3-[3-(methoxymethyl)phenyl]benzonitrile::A313326 Analogue 25
SMILES: COCc1cccc(c1)-c1cc(ccc1COC(c1cncn1C)c1ccc(cc1)C#N)C#N
InChI Key: InChIKey=AIOFERITDFXPBZ-UHFFFAOYSA-N
Data: 3 IC50
Activity Spreadsheet -- Enzyme Inhibition Constant Data from BindingDB
Found 3 hits for monomerid = 13390
Trg + Lig
Ki
nM
ΔG°
kcal/mole
IC50
nM
Kd
nM
EC50/IC50
nM
koff
s-1
kon
M-1s-1
pHTemp
°C
Protein farnesyl/geranylgeranyl transferase
(Homo sapiens (Human))
BDBM13390
(4-{[(4-cyanophenyl)(1-methyl-1H-imidazol-5-yl)meth...)
Show SMILES COCc1cccc(c1)-c1cc(ccc1COC(c1cncn1C)c1ccc(cc1)C#N)C#N
Show InChI InChI=1S/C28H24N4O2/c1-32-19-31-16-27(32)28(23-9-6-20(14-29)7-10-23)34-18-25-11-8-21(15-30)13-26(25)24-5-3-4-22(12-24)17-33-2/h3-13,16,19,28H,17-18H2,1-2H3
Reactome pathway
n/an/a 0.190n/an/an/an/an/an/a
Globe Pharmaceutical R and Abbott Laboratories
Assay Description
The in vitro activity of compounds inhibiting FTase or GGTase-I was determined by using scintillation proximity assay (SPA) technology. The assays we...
J Med Chem 47: 612-26 (2004)
Article DOI: 10.1021/jm030434f
BindingDB Entry DOI: 10.7270/Q2Z60M8D
Protein Farnesyltransferase (PFT)
(Homo sapiens (Human))
BDBM13390
(4-{[(4-cyanophenyl)(1-methyl-1H-imidazol-5-yl)meth...)
Show SMILES COCc1cccc(c1)-c1cc(ccc1COC(c1cncn1C)c1ccc(cc1)C#N)C#N
Show InChI InChI=1S/C28H24N4O2/c1-32-19-31-16-27(32)28(23-9-6-20(14-29)7-10-23)34-18-25-11-8-21(15-30)13-26(25)24-5-3-4-22(12-24)17-33-2/h3-13,16,19,28H,17-18H2,1-2H3
Reactome pathway
n/an/a 191n/an/an/an/an/an/a
The M.S. University of Baroda
Curated by ChEMBL
Assay Description
Inhibition of FTase
Bioorg Med Chem Lett 16: 1821-7 (2006)
Article DOI: 10.1016/j.bmcl.2006.01.019
BindingDB Entry DOI: 10.7270/Q2W66PJG
Geranylgeranyl transferase type I
(Bos taurus (bovine))
BDBM13390
(4-{[(4-cyanophenyl)(1-methyl-1H-imidazol-5-yl)meth...)
Show SMILES COCc1cccc(c1)-c1cc(ccc1COC(c1cncn1C)c1ccc(cc1)C#N)C#N
Show InChI InChI=1S/C28H24N4O2/c1-32-19-31-16-27(32)28(23-9-6-20(14-29)7-10-23)34-18-25-11-8-21(15-30)13-26(25)24-5-3-4-22(12-24)17-33-2/h3-13,16,19,28H,17-18H2,1-2H3
n/an/a 1.80E+3n/an/an/an/an/an/a
Globe Pharmaceutical R and Abbott Laboratories
Assay Description
The in vitro activity of compounds inhibiting FTase or GGTase-I was determined by using scintillation proximity assay (SPA) technology. The assays we...
J Med Chem 47: 612-26 (2004)
Article DOI: 10.1021/jm030434f
BindingDB Entry DOI: 10.7270/Q2Z60M8D