BDBM13412 A313326 Analogue 60a::N-(5-cyano-2-{[(4-cyanophenyl)(1-methyl-1H-imidazol-5-yl)methoxy]methyl}phenyl)thiophene-2-sulfonamide
SMILES: Cn1cncc1C(OCc1ccc(cc1NS(=O)(=O)c1cccs1)C#N)c1ccc(cc1)C#N
InChI Key: InChIKey=GOWYQYXITBPMTO-UHFFFAOYSA-N
Data: 3 IC50
Activity Spreadsheet -- Enzyme Inhibition Constant Data from BindingDB
Found 3 hits for monomerid = 13412
Trg + Lig
Ki
nM
ΔG°
kcal/mole
IC50
nM
Kd
nM
EC50/IC50
nM
koff
s-1
kon
M-1s-1
pHTemp
°C
Protein farnesyl/geranylgeranyl transferase
(Homo sapiens (Human))
BDBM13412
(A313326 Analogue 60a | N-(5-cyano-2-{[(4-cyanophen...)
Show SMILES Cn1cncc1C(OCc1ccc(cc1NS(=O)(=O)c1cccs1)C#N)c1ccc(cc1)C#N
Show InChI InChI=1S/C24H19N5O3S2/c1-29-16-27-14-22(29)24(19-7-4-17(12-25)5-8-19)32-15-20-9-6-18(13-26)11-21(20)28-34(30,31)23-3-2-10-33-23/h2-11,14,16,24,28H,15H2,1H3
Reactome pathway
n/an/a 0.880n/an/an/an/an/an/a
Globe Pharmaceutical R and Abbott Laboratories
Assay Description
The in vitro activity of compounds inhibiting FTase or GGTase-I was determined by using scintillation proximity assay (SPA) technology. The assays we...
J Med Chem 47: 612-26 (2004)
Article DOI: 10.1021/jm030434f
BindingDB Entry DOI: 10.7270/Q2Z60M8D
Protein Farnesyltransferase (PFT)
(Homo sapiens (Human))
BDBM13412
(A313326 Analogue 60a | N-(5-cyano-2-{[(4-cyanophen...)
Show SMILES Cn1cncc1C(OCc1ccc(cc1NS(=O)(=O)c1cccs1)C#N)c1ccc(cc1)C#N
Show InChI InChI=1S/C24H19N5O3S2/c1-29-16-27-14-22(29)24(19-7-4-17(12-25)5-8-19)32-15-20-9-6-18(13-26)11-21(20)28-34(30,31)23-3-2-10-33-23/h2-11,14,16,24,28H,15H2,1H3
Reactome pathway
n/an/a 891n/an/an/an/an/an/a
The M.S. University of Baroda
Curated by ChEMBL
Assay Description
Inhibition of FTase
Bioorg Med Chem Lett 16: 1821-7 (2006)
Article DOI: 10.1016/j.bmcl.2006.01.019
BindingDB Entry DOI: 10.7270/Q2W66PJG
Geranylgeranyl transferase type I
(Bos taurus (bovine))
BDBM13412
(A313326 Analogue 60a | N-(5-cyano-2-{[(4-cyanophen...)
Show SMILES Cn1cncc1C(OCc1ccc(cc1NS(=O)(=O)c1cccs1)C#N)c1ccc(cc1)C#N
Show InChI InChI=1S/C24H19N5O3S2/c1-29-16-27-14-22(29)24(19-7-4-17(12-25)5-8-19)32-15-20-9-6-18(13-26)11-21(20)28-34(30,31)23-3-2-10-33-23/h2-11,14,16,24,28H,15H2,1H3
n/an/a 220n/an/an/an/an/an/a
Globe Pharmaceutical R and Abbott Laboratories
Assay Description
The in vitro activity of compounds inhibiting FTase or GGTase-I was determined by using scintillation proximity assay (SPA) technology. The assays we...
J Med Chem 47: 612-26 (2004)
Article DOI: 10.1021/jm030434f
BindingDB Entry DOI: 10.7270/Q2Z60M8D