null
SMILES: CN1CCN(CC1)S(=O)(=O)c1ccc(cc1)-c1ccc(C[C@H](NC(=O)[C@H]2N[C@@H]3CC[C@H]2C3)C#N)s1
InChI Key: InChIKey=KTVUUDSQXGTMCQ-VKDGWMQASA-N
Activity Spreadsheet -- Enzyme Inhibition Constant Data from BindingDB
Found 1 hit for monomerid = 138137
Trg + Lig
Ki
nM
ΔG°
kcal/mole
IC50
nM
Kd
nM
EC50/IC50
nM
koff
s-1
kon
M-1s-1
pHTemp
°C
Dipeptidyl peptidase 1
(Homo sapiens (Human))
BDBM138137
(US8871783, 23)
Show SMILES CN1CCN(CC1)S(=O)(=O)c1ccc(cc1)-c1ccc(C[C@H](NC(=O)[C@H]2N[C@@H]3CC[C@H]2C3)C#N)s1 |r|
Show InChI InChI=1S/C25H31N5O3S2/c1-29-10-12-30(13-11-29)35(32,33)22-7-3-17(4-8-22)23-9-6-21(34-23)15-20(16-26)28-25(31)24-18-2-5-19(14-18)27-24/h3-4,6-9,18-20,24,27H,2,5,10-15H2,1H3,(H,28,31)/t18-,19+,20-,24-/m0/s1
US Patent
2.90 -11.6n/an/an/an/an/a6.025
Boehringer Ingelheim International GmBh
US Patent
Assay Description
The following buffers were used: MES buffer: 25 mM MES, 50 mM NaCl, 5 mM DTT, adjusted to pH 6.0, containing 0.1% BSA; TAGZyme Buffer: 20 mM NaH2PO4,...
US Patent US8871783 (2014)
BindingDB Entry DOI: 10.7270/Q2F18XF1