BDBM14696 4-[(2S)-2-(acetylamino)-3-{[(3S)-1-(biphenyl-4-ylmethyl)-2-oxoazepan-3-yl]amino}-3-oxopropyl]-2-formylbenzoic acid::4-[(2S)-2-acetamido-2-{[(3S)-2-oxo-1-[(4-phenylphenyl)methyl]azepan-3-yl]carbamoyl}ethyl]-2-formylbenzoic acid::Inhibitor 8::RU82197
SMILES: CC(=O)N[C@@H](Cc1ccc(C(O)=O)c(C=O)c1)C(=O)N[C@H]1CCCCN(Cc2ccc(cc2)-c2ccccc2)C1=O
InChI Key: InChIKey=WKTQBTSOHBKBRW-VMPREFPWSA-N
Data: 1 IC50
PDB links: 1 PDB ID matches this monomer.
Activity Spreadsheet -- Enzyme Inhibition Constant Data from BindingDB
Found 1 hit for monomerid = 14696
Trg + Lig
Ki
nM
ΔG°
kcal/mole
IC50
nM
Kd
nM
EC50/IC50
nM
koff
s-1
kon
M-1s-1
pHTemp
°C
Proto-oncogene tyrosine-protein kinase Src [145-252]
(Homo sapiens (Human))
BDBM14696
(4-[(2S)-2-(acetylamino)-3-{[(3S)-1-(biphenyl-4-ylm...)
Show SMILES CC(=O)N[C@@H](Cc1ccc(C(O)=O)c(C=O)c1)C(=O)N[C@H]1CCCCN(Cc2ccc(cc2)-c2ccccc2)C1=O |r|
Show InChI InChI=1S/C32H33N3O6/c1-21(37)33-29(18-23-12-15-27(32(40)41)26(17-23)20-36)30(38)34-28-9-5-6-16-35(31(28)39)19-22-10-13-25(14-11-22)24-7-3-2-4-8-24/h2-4,7-8,10-15,17,20,28-29H,5-6,9,16,18-19H2,1H3,(H,33,37)(H,34,38)(H,40,41)/t28-,29-/m0/s1
n/an/a 120n/an/an/an/an/an/a
Aventis Pharma
Assay Description
SPA uses 125I as energy donor and scintillant-coated beads as energy acceptor. The labeled ligand is captured by the biotinylated Src-SH2 protein imm...
J Med Chem 46: 5184-95 (2003)
Article DOI: 10.1021/jm020970s
BindingDB Entry DOI: 10.7270/Q2XW4H14
3D
3D Structure (crystal)