BDBM151514 US8987314, B325
SMILES: Cc1cc2nc(sc2cc1-c1ccc(cc1)C(O)=O)C(C(=O)NCCS(N)(=O)=O)S(=O)(=O)Cc1ccccc1
InChI Key: InChIKey=FGYILSKPCFDTDS-UHFFFAOYSA-N
Data: 2 IC50
Activity Spreadsheet -- Enzyme Inhibition Constant Data from BindingDB
Found 2 hits for monomerid = 151514
Trg + Lig
Ki
nM
ΔG°
kcal/mole
IC50
nM
Kd
nM
EC50/IC50
nM
koff
s-1
kon
M-1s-1
pHTemp
°C
Hepatic Lipase (HL)
(Homo sapiens (Human))
BDBM151514
(US8987314, B325)
Show SMILES Cc1cc2nc(sc2cc1-c1ccc(cc1)C(O)=O)C(C(=O)NCCS(N)(=O)=O)S(=O)(=O)Cc1ccccc1
Show InChI InChI=1S/C26H25N3O7S3/c1-16-13-21-22(14-20(16)18-7-9-19(10-8-18)26(31)32)37-25(29-21)23(24(30)28-11-12-39(27,35)36)38(33,34)15-17-5-3-2-4-6-17/h2-10,13-14,23H,11-12,15H2,1H3,(H,28,30)(H,31,32)(H2,27,35,36)
US Patent
n/an/a 104n/an/an/an/a8.025
Bristol-Myers Squibb Company
US Patent
Assay Description
Endothelial lipase (EL) and hepatic lipase (HL) activities were measured using a fluorescent substrate, A10070, (Invitrogen, CA) doped into an artifi...
US Patent US8987314 (2015)
BindingDB Entry DOI: 10.7270/Q2W094N8
Endothelial lipase
(Homo sapiens (Human))
BDBM151514
(US8987314, B325)
Show SMILES Cc1cc2nc(sc2cc1-c1ccc(cc1)C(O)=O)C(C(=O)NCCS(N)(=O)=O)S(=O)(=O)Cc1ccccc1
Show InChI InChI=1S/C26H25N3O7S3/c1-16-13-21-22(14-20(16)18-7-9-19(10-8-18)26(31)32)37-25(29-21)23(24(30)28-11-12-39(27,35)36)38(33,34)15-17-5-3-2-4-6-17/h2-10,13-14,23H,11-12,15H2,1H3,(H,28,30)(H,31,32)(H2,27,35,36)
US Patent
n/an/a 1.20n/an/an/an/a8.025
Bristol-Myers Squibb Company
US Patent
Assay Description
Endothelial lipase (EL) and hepatic lipase (HL) activities were measured using a fluorescent substrate, A10070, (Invitrogen, CA) doped into an artifi...
US Patent US8987314 (2015)
BindingDB Entry DOI: 10.7270/Q2W094N8