null
SMILES: [O-]C(=O)C1=CSC2N1C(=O)\C2=C\c1cc2CSCn2n1
InChI Key: InChIKey=PIQJFYXOGLAPEL-WAPJZHGLSA-M
Activity Spreadsheet -- Enzyme Inhibition Constant Data from BindingDB
Found 1 hit for monomerid = 152732
Trg + Lig
Ki
nM
ΔG°
kcal/mole
IC50
nM
Kd
nM
EC50/IC50
nM
koff
s-1
kon
M-1s-1
pHTemp
°C
Beta-lactamase
(Mycobacterium tuberculosis H37Rv)
BDBM152732
(Penem 1)
Show SMILES [O-]C(=O)C1=CSC2N1C(=O)\C2=C\c1cc2CSCn2n1 |t:3|
Show InChI InChI=1S/C12H9N3O3S2/c16-10-8(11-15(10)9(4-20-11)12(17)18)2-6-1-7-3-19-5-14(7)13-6/h1-2,4,11H,3,5H2,(H,17,18)/p-1/b8-2-
800n/an/an/an/an/an/a7.2n/a
Indian Institute of Technology
Assay Description
Steady state kinetics were performed on an Agilent 8453 diode array spectrophotometer in sodium phosphate buffer (50 mM, pH 7.2) and a 1 cm pathlengt...
Biochemistry 54: 5657-64 (2015)
Article DOI: 10.1021/acs.biochem.5b00698
BindingDB Entry DOI: 10.7270/Q29W0D7G