BDBM15911 2-pyridinecarboxamide deriv. 8a::4-Amino-5-cyano-6-ethoxy-pyridine-2-carboxylic acid methylamide::4-amino-5-cyano-6-ethoxy-N-methylpyridine-2-carboxamide
SMILES: CCOc1nc(cc(N)c1C#N)C(=O)NC
InChI Key: InChIKey=ZJEWMDXOXBQHAB-UHFFFAOYSA-N
Data: 2 IC50
Activity Spreadsheet -- Enzyme Inhibition Constant Data from BindingDB
Found 2 hits for monomerid = 15911
Trg + Lig
Ki
nM
ΔG°
kcal/mole
IC50
nM
Kd
nM
EC50/IC50
nM
koff
s-1
kon
M-1s-1
pHTemp
°C
Mitogen-activated protein kinase 9
(Homo sapiens (Human))
BDBM15911
(2-pyridinecarboxamide deriv. 8a | 4-Amino-5-cyano-...)
Show SMILES CCOc1nc(cc(N)c1C#N)C(=O)NC
Show InChI InChI=1S/C10H12N4O2/c1-3-16-10-6(5-11)7(12)4-8(14-10)9(15)13-2/h4H,3H2,1-2H3,(H2,12,14)(H,13,15)
NCI pathway
Reactome pathway
n/an/a 610n/an/an/an/an/an/a
Abbott Laboratories
Assay Description
In vitro substrate phosphorylation using purified recombinant JNK, was incubated with substrate, and test compounds in the presence of 5uM ATP/ [gamm...
J Med Chem 49: 4455-8 (2006)
Article DOI: 10.1021/jm060465l
BindingDB Entry DOI: 10.7270/Q2ST7N3W
Mitogen-activated protein kinase 8
(Homo sapiens (Human))
BDBM15911
(2-pyridinecarboxamide deriv. 8a | 4-Amino-5-cyano-...)
Show SMILES CCOc1nc(cc(N)c1C#N)C(=O)NC
Show InChI InChI=1S/C10H12N4O2/c1-3-16-10-6(5-11)7(12)4-8(14-10)9(15)13-2/h4H,3H2,1-2H3,(H2,12,14)(H,13,15)
NCI pathway
Reactome pathway
n/an/a 1.20E+3n/an/an/an/a7.220
Abbott Laboratories
Assay Description
In vitro substrate phosphorylation using purified recombinant JNK, was incubated with substrate, and test compounds in the presence of 5uM ATP/ [gamm...
J Med Chem 49: 4455-8 (2006)
Article DOI: 10.1021/jm060465l
BindingDB Entry DOI: 10.7270/Q2ST7N3W