BDBM15917 2-pyridinecarboxamide deriv. 8g::4-amino-5-cyano-6-ethoxy-N-[(4-methanesulfonylphenyl)methyl]-N-methylpyridine-2-carboxamide
SMILES: CCOc1nc(cc(N)c1C#N)C(=O)N(C)Cc1ccc(cc1)S(C)(=O)=O
InChI Key: InChIKey=GJNVKVRPPJSIIJ-UHFFFAOYSA-N
Data: 2 IC50
Activity Spreadsheet -- Enzyme Inhibition Constant Data from BindingDB
Found 2 hits for monomerid = 15917
Trg + Lig
Ki
nM
ΔG°
kcal/mole
IC50
nM
Kd
nM
EC50/IC50
nM
koff
s-1
kon
M-1s-1
pHTemp
°C
Mitogen-activated protein kinase 9
(Homo sapiens (Human))
BDBM15917
(2-pyridinecarboxamide deriv. 8g | 4-amino-5-cyano-...)
Show SMILES CCOc1nc(cc(N)c1C#N)C(=O)N(C)Cc1ccc(cc1)S(C)(=O)=O
Show InChI InChI=1S/C18H20N4O4S/c1-4-26-17-14(10-19)15(20)9-16(21-17)18(23)22(2)11-12-5-7-13(8-6-12)27(3,24)25/h5-9H,4,11H2,1-3H3,(H2,20,21)
NCI pathway
Reactome pathway
n/an/a>1.00E+4n/an/an/an/an/an/a
Abbott Laboratories
Assay Description
In vitro substrate phosphorylation using purified recombinant JNK, was incubated with substrate, and test compounds in the presence of 5uM ATP/ [gamm...
J Med Chem 49: 4455-8 (2006)
Article DOI: 10.1021/jm060465l
BindingDB Entry DOI: 10.7270/Q2ST7N3W
Mitogen-activated protein kinase 8
(Homo sapiens (Human))
BDBM15917
(2-pyridinecarboxamide deriv. 8g | 4-amino-5-cyano-...)
Show SMILES CCOc1nc(cc(N)c1C#N)C(=O)N(C)Cc1ccc(cc1)S(C)(=O)=O
Show InChI InChI=1S/C18H20N4O4S/c1-4-26-17-14(10-19)15(20)9-16(21-17)18(23)22(2)11-12-5-7-13(8-6-12)27(3,24)25/h5-9H,4,11H2,1-3H3,(H2,20,21)
NCI pathway
Reactome pathway
n/an/a 6.40E+3n/an/an/an/a7.220
Abbott Laboratories
Assay Description
In vitro substrate phosphorylation using purified recombinant JNK, was incubated with substrate, and test compounds in the presence of 5uM ATP/ [gamm...
J Med Chem 49: 4455-8 (2006)
Article DOI: 10.1021/jm060465l
BindingDB Entry DOI: 10.7270/Q2ST7N3W