null
SMILES: CCCN(CCC)C(=O)c1cccc(c1)C(=O)N[C@@H](CC(C)C)[C@@H](O)C[C@@H](C)C(=O)N[C@@H](C(C)C)C(=O)NCc1ccccc1
InChI Key: InChIKey=LUQWTUMHHVQVET-IOUGBZEOSA-N
Activity Spreadsheet -- Enzyme Inhibition Constant Data from BindingDB
Found 1 hit for monomerid = 16286
Trg + Lig
Ki
nM
ΔG°
kcal/mole
IC50
nM
Kd
nM
EC50/IC50
nM
koff
s-1
kon
M-1s-1
pHTemp
°C
Beta-secretase 1 [22-454]
(Homo sapiens (Human))
BDBM16286
(3-N-[(1R,3S,4S)-1-{[(1S)-1-(benzylcarbamoyl)-2-met...)
Show SMILES CCCN(CCC)C(=O)c1cccc(c1)C(=O)N[C@@H](CC(C)C)[C@@H](O)C[C@@H](C)C(=O)N[C@@H](C(C)C)C(=O)NCc1ccccc1 |r|
Show InChI InChI=1S/C36H54N4O5/c1-8-18-40(19-9-2)36(45)29-17-13-16-28(22-29)34(43)38-30(20-24(3)4)31(41)21-26(7)33(42)39-32(25(5)6)35(44)37-23-27-14-11-10-12-15-27/h10-17,22,24-26,30-32,41H,8-9,18-21,23H2,1-7H3,(H,37,44)(H,38,43)(H,39,42)/t26-,30+,31+,32+/m1/s1
71 -9.65n/an/an/an/an/a4.522
Sunesis
Assay Description
Compounds were tested for their ability to inhibit BACE-1 hydrolysis of the internally quenched fluorescent substrate FS-2. Reactions were initiated ...
J Med Chem 49: 839-42 (2006)
Article DOI: 10.1021/jm0509142
BindingDB Entry DOI: 10.7270/Q2PV6HM0