BDBM16546 (2S)-1-(3-bromophenyl)-3-{[5-(3-methyl-1H-indazol-5-yl)pyridin-3-yl]oxy}propan-2-amine::5-{5-[(2S)-2-amino-3-(3-bromophenyl)propoxy]pyridin-3-yl}-3-methyl-1H-indazole::indazole-pyridine, 13k
SMILES: Cc1n[nH]c2ccc(cc12)-c1cncc(OC[C@@H](N)Cc2cccc(Br)c2)c1
InChI Key: InChIKey=KODVNMIRYZAUSU-IBGZPJMESA-N
Data: 1 IC50
Activity Spreadsheet -- Enzyme Inhibition Constant Data from BindingDB
Found 1 hit for monomerid = 16546
Trg + Lig
Ki
nM
ΔG°
kcal/mole
IC50
nM
Kd
nM
EC50/IC50
nM
koff
s-1
kon
M-1s-1
pHTemp
°C
Protein kinase B (Akt 1)
(Homo sapiens (Human))
BDBM16546
((2S)-1-(3-bromophenyl)-3-{[5-(3-methyl-1H-indazol-...)
Show SMILES Cc1n[nH]c2ccc(cc12)-c1cncc(OC[C@@H](N)Cc2cccc(Br)c2)c1 |r|
Show InChI InChI=1S/C22H21BrN4O/c1-14-21-10-16(5-6-22(21)27-26-14)17-9-20(12-25-11-17)28-13-19(24)8-15-3-2-4-18(23)7-15/h2-7,9-12,19H,8,13,24H2,1H3,(H,26,27)/t19-/m0/s1
n/an/a 2.10n/an/an/an/an/an/a
Abbott Laboratories
Assay Description
The kinase assay uses His-Akt1 and a biotinylated peptide as substrate. The biotinylated peptides were immobilized on streptavidin-coated FLASH plat...
J Med Chem 50: 2990-3003 (2007)
Article DOI: 10.1021/jm0701019
BindingDB Entry DOI: 10.7270/Q24X562F