BDBM16586 (2S)-1-{[5-(3-chloro-1H-pyrazolo[3,4-c]pyridin-5-yl)pyridin-3-yl]oxy}-3-[3-(trifluoromethyl)phenyl]propan-2-amine::3-[(2S)-2-amino-3-[3-(trifluoromethyl)phenyl]propoxy]-5-{3-chloro-1H-pyrazolo[3,4-c]pyridin-5-yl}pyridine::pyrazolopyridine-pyridine, 37b
SMILES: N[C@H](COc1cncc(c1)-c1cc2c(Cl)n[nH]c2cn1)Cc1cccc(c1)C(F)(F)F
InChI Key: InChIKey=WHPGUDAVAIYVRR-HNNXBMFYSA-N
Data: 2 IC50
Activity Spreadsheet -- Enzyme Inhibition Constant Data from BindingDB
Found 2 hits for monomerid = 16586
Trg + Lig
Ki
nM
ΔG°
kcal/mole
IC50
nM
Kd
nM
EC50/IC50
nM
koff
s-1
kon
M-1s-1
pHTemp
°C
cAMP-dependent protein kinase catalytic subunit alpha
(Bos taurus (bovine))
BDBM16586
((2S)-1-{[5-(3-chloro-1H-pyrazolo[3,4-c]pyridin-5-y...)
Show SMILES N[C@H](COc1cncc(c1)-c1cc2c(Cl)n[nH]c2cn1)Cc1cccc(c1)C(F)(F)F |r|
Show InChI InChI=1S/C21H17ClF3N5O/c22-20-17-7-18(28-10-19(17)29-30-20)13-6-16(9-27-8-13)31-11-15(26)5-12-2-1-3-14(4-12)21(23,24)25/h1-4,6-10,15H,5,11,26H2,(H,29,30)/t15-/m0/s1
n/an/a 15n/an/an/an/an/an/a
Abbott Laboratories
Assay Description
The kinase assay uses purified recombinant enzyme and a biotinylated peptide as substrate. The biotinylated peptides were immobilized on streptavidi...
J Med Chem 50: 2990-3003 (2007)
Article DOI: 10.1021/jm0701019
BindingDB Entry DOI: 10.7270/Q24X562F
RAC-alpha serine/threonine-protein kinase [139-480,S378A,S381A,T450D,S473D]
(Homo sapiens (Human))
BDBM16586
((2S)-1-{[5-(3-chloro-1H-pyrazolo[3,4-c]pyridin-5-y...)
Show SMILES N[C@H](COc1cncc(c1)-c1cc2c(Cl)n[nH]c2cn1)Cc1cccc(c1)C(F)(F)F |r|
Show InChI InChI=1S/C21H17ClF3N5O/c22-20-17-7-18(28-10-19(17)29-30-20)13-6-16(9-27-8-13)31-11-15(26)5-12-2-1-3-14(4-12)21(23,24)25/h1-4,6-10,15H,5,11,26H2,(H,29,30)/t15-/m0/s1
n/an/a 2.90n/an/an/an/an/an/a
Abbott Laboratories
Assay Description
The kinase assay uses His-Akt1 and a biotinylated peptide as substrate. The biotinylated peptides were immobilized on streptavidin-coated FLASH plat...
J Med Chem 50: 2990-3003 (2007)
Article DOI: 10.1021/jm0701019
BindingDB Entry DOI: 10.7270/Q24X562F