BDBM165915 US9067924, 9
SMILES: CC1C(N)=N[C@@](C)(CCS1(=O)=O)c1cc(NC(=O)c2[nH]ncc2Cl)ccc1F
InChI Key:
Data: 2 IC50
Activity Spreadsheet -- Enzyme Inhibition Constant Data from BindingDB
Found 2 hits for monomerid = 165915
Trg + Lig
Ki
nM
ΔG°
kcal/mole
IC50
nM
Kd
nM
EC50/IC50
nM
koff
s-1
kon
M-1s-1
pHTemp
°C
Beta-secretase 1 (BACE1)
(Mus musculus (Mouse))
BDBM165915
(US9067924, 9)
Show SMILES CC1C(N)=N[C@@](C)(CCS1(=O)=O)c1cc(NC(=O)c2[nH]ncc2Cl)ccc1F |r,c:3|
US Patent
n/an/a 300n/an/an/an/an/an/a
HOFFMANN-LA ROCHE INC.
US Patent
Assay Description
An ELISA assay (using a pair of mouse anti-human-TMEM27 antibodies, raised against the extracellular domain of TMEM27) is used for detection of TMEM2...
US Patent US9067924 (2015)
BindingDB Entry DOI: 10.7270/Q2R21049
Beta-secretase 2 (BACE2)
(Mus musculus (Mouse))
BDBM165915
(US9067924, 9)
Show SMILES CC1C(N)=N[C@@](C)(CCS1(=O)=O)c1cc(NC(=O)c2[nH]ncc2Cl)ccc1F |r,c:3|
US Patent
n/an/a 858n/an/an/an/an/an/a
HOFFMANN-LA ROCHE INC.
US Patent
Assay Description
An ELISA assay (using a pair of mouse anti-human-TMEM27 antibodies, raised against the extracellular domain of TMEM27) is used for detection of TMEM2...
US Patent US9067924 (2015)
BindingDB Entry DOI: 10.7270/Q2R21049