BDBM16781 Substrate-based BACE-1 inhibitor, 23::tert-butyl N-[(1S)-1-{[(1S)-1-{[(1R,3S,4S)-1-{[(1S)-1-(benzylcarbamoyl)-2-methylpropyl]carbamoyl}-3-hydroxy-1,6-dimethylheptan-4-yl]carbamoyl}-3-methanesulfonylpropyl]carbamoyl}-2-methylpropyl]carbamate
SMILES: CC(C)C[C@H](NC(=O)[C@H](CCS(C)(=O)=O)NC(=O)[C@@H](NC(=O)OC(C)(C)C)C(C)C)[C@@H](O)C[C@@H](C)C(=O)N[C@@H](C(C)C)C(=O)NCc1ccccc1
InChI Key: InChIKey=ZPHIGADCEJRCRP-KNSFHFJMSA-N
Data: 1 KI
Activity Spreadsheet -- Enzyme Inhibition Constant Data from BindingDB
Found 1 hit for monomerid = 16781
Trg + Lig
Ki
nM
ΔG°
kcal/mole
IC50
nM
Kd
nM
EC50/IC50
nM
koff
s-1
kon
M-1s-1
pHTemp
°C
Beta-secretase 1
(Homo sapiens (Human))
BDBM16781
(Substrate-based BACE-1 inhibitor, 23 | tert-butyl ...)
Show SMILES CC(C)C[C@H](NC(=O)[C@H](CCS(C)(=O)=O)NC(=O)[C@@H](NC(=O)OC(C)(C)C)C(C)C)[C@@H](O)C[C@@H](C)C(=O)N[C@@H](C(C)C)C(=O)NCc1ccccc1 |r|
Show InChI InChI=1S/C37H63N5O9S/c1-22(2)19-28(29(43)20-25(7)32(44)41-30(23(3)4)34(46)38-21-26-15-13-12-14-16-26)40-33(45)27(17-18-52(11,49)50)39-35(47)31(24(5)6)42-36(48)51-37(8,9)10/h12-16,22-25,27-31,43H,17-21H2,1-11H3,(H,38,46)(H,39,47)(H,40,45)(H,41,44)(H,42,48)/t25-,27+,28+,29+,30+,31+/m1/s1
8 -11.5n/an/an/an/an/a4.537
University of Illinois at Chicago
Assay Description
Enzyme activities were assayed by monitoring the hydrolysis of substrate in the presence or absence of inhibitor compounds. The hydrolysis was record...
J Med Chem 44: 2865-8 (2001)
Article DOI: 10.1021/jm0101803
BindingDB Entry DOI: 10.7270/Q2BG2M7W