null
SMILES: N[C@H](COc1cncc(c1)-c1cc2c(Cl)n[nH]c2cn1)Cc1ccccc1
InChI Key: InChIKey=ZAMACYCHJDCXFC-HNNXBMFYSA-N
Activity Spreadsheet -- Enzyme Inhibition Constant Data from BindingDB
Found 3 hits for monomerid = 16792
Trg + Lig
Ki
nM
ΔG°
kcal/mole
IC50
nM
Kd
nM
EC50/IC50
nM
koff
s-1
kon
M-1s-1
pHTemp
°C
RAC-alpha serine/threonine-protein kinase [139-480,S378A,S381A,T450D,S473D]
(Homo sapiens (Human))
BDBM16792
(3-[(2S)-2-amino-3-phenylpropoxy]-5-{3-chloro-1H-py...)
Show SMILES N[C@H](COc1cncc(c1)-c1cc2c(Cl)n[nH]c2cn1)Cc1ccccc1 |r|
Show InChI InChI=1S/C20H18ClN5O/c21-20-17-8-18(24-11-19(17)25-26-20)14-7-16(10-23-9-14)27-12-15(22)6-13-4-2-1-3-5-13/h1-5,7-11,15H,6,12,22H2,(H,25,26)/t15-/m0/s1
n/an/a 59n/an/an/an/a7.522
Abbott Laboratories
Assay Description
The kinase assay uses His-Akt1 and a biotinylated peptide as substrate. The biotinylated peptides were immobilized on streptavidin-coated FLASH plat...
Bioorg Med Chem 15: 2441-52 (2007)
Article DOI: 10.1016/j.bmc.2007.01.010
BindingDB Entry DOI: 10.7270/Q26Q1VGQ
RAC-alpha serine/threonine-protein kinase
(Homo sapiens (Human))
BDBM16792
(3-[(2S)-2-amino-3-phenylpropoxy]-5-{3-chloro-1H-py...)
Show SMILES N[C@H](COc1cncc(c1)-c1cc2c(Cl)n[nH]c2cn1)Cc1ccccc1 |r|
Show InChI InChI=1S/C20H18ClN5O/c21-20-17-8-18(24-11-19(17)25-26-20)14-7-16(10-23-9-14)27-12-15(22)6-13-4-2-1-3-5-13/h1-5,7-11,15H,6,12,22H2,(H,25,26)/t15-/m0/s1
n/an/a 59n/an/an/an/an/an/a
Zhejiang University
Curated by ChEMBL
Assay Description
Inhibition of Akt
Eur J Med Chem 44: 4090-7 (2009)
Article DOI: 10.1016/j.ejmech.2009.04.050
BindingDB Entry DOI: 10.7270/Q2GT5N74
cAMP-dependent protein kinase catalytic subunit alpha
(Bos taurus (bovine))
BDBM16792
(3-[(2S)-2-amino-3-phenylpropoxy]-5-{3-chloro-1H-py...)
Show SMILES N[C@H](COc1cncc(c1)-c1cc2c(Cl)n[nH]c2cn1)Cc1ccccc1 |r|
Show InChI InChI=1S/C20H18ClN5O/c21-20-17-8-18(24-11-19(17)25-26-20)14-7-16(10-23-9-14)27-12-15(22)6-13-4-2-1-3-5-13/h1-5,7-11,15H,6,12,22H2,(H,25,26)/t15-/m0/s1
n/an/a 46n/an/an/an/an/an/a
Abbott Laboratories
Assay Description
The kinase assay uses purified recombinant enzyme and a biotinylated peptide as substrate. The biotinylated peptides were immobilized on streptavidi...
Bioorg Med Chem 15: 2441-52 (2007)
Article DOI: 10.1016/j.bmc.2007.01.010
BindingDB Entry DOI: 10.7270/Q26Q1VGQ