BDBM16813 (2S)-2-[(2,6-dichlorophenyl)formamido]-3-{4-[5-(difluoromethoxy)-2-methyl-3-oxo-2,3-dihydropyridazin-4-yl]phenyl}propanoic acid::pyridazinone-based antagonist, 15
SMILES: Cn1ncc(OC(F)F)c(-c2ccc(C[C@H](NC(=O)c3c(Cl)cccc3Cl)C(O)=O)cc2)c1=O
InChI Key: InChIKey=NKMZFGYUMYFYSM-HNNXBMFYSA-N
Data: 2 IC50
Activity Spreadsheet -- Enzyme Inhibition Constant Data from BindingDB
Found 2 hits for monomerid = 16813
Trg + Lig
Ki
nM
ΔG°
kcal/mole
IC50
nM
Kd
nM
EC50/IC50
nM
koff
s-1
kon
M-1s-1
pHTemp
°C
Integrin alpha4beta7
(Homo sapiens (Human))
BDBM16813
((2S)-2-[(2,6-dichlorophenyl)formamido]-3-{4-[5-(di...)
Show SMILES Cn1ncc(OC(F)F)c(-c2ccc(C[C@H](NC(=O)c3c(Cl)cccc3Cl)C(O)=O)cc2)c1=O |r|
Show InChI InChI=1S/C22H17Cl2F2N3O5/c1-29-20(31)17(16(10-27-29)34-22(25)26)12-7-5-11(6-8-12)9-15(21(32)33)28-19(30)18-13(23)3-2-4-14(18)24/h2-8,10,15,22H,9H2,1H3,(H,28,30)(H,32,33)/t15-/m0/s1
n/an/a 8n/an/an/an/an/a4
Johnson & Johnson Pharmaceutical
Assay Description
M2 anti-FLAG antibody coated 96-well plates were coated with recombinant FLAG-hMAdCAM-1 contained in Dulbecco PBS. The compounds to be tested were ad...
J Med Chem 49: 3402-11 (2006)
Article DOI: 10.1021/jm060031q
BindingDB Entry DOI: 10.7270/Q2Z60M9V
Integrin alpha4beta1 (VLA-4)
(Homo sapiens (Human))
BDBM16813
((2S)-2-[(2,6-dichlorophenyl)formamido]-3-{4-[5-(di...)
Show SMILES Cn1ncc(OC(F)F)c(-c2ccc(C[C@H](NC(=O)c3c(Cl)cccc3Cl)C(O)=O)cc2)c1=O |r|
Show InChI InChI=1S/C22H17Cl2F2N3O5/c1-29-20(31)17(16(10-27-29)34-22(25)26)12-7-5-11(6-8-12)9-15(21(32)33)28-19(30)18-13(23)3-2-4-14(18)24/h2-8,10,15,22H,9H2,1H3,(H,28,30)(H,32,33)/t15-/m0/s1
n/an/a 280n/an/an/an/a7.422
Johnson & Johnson Pharmaceutical
Assay Description
Immulon 96-well plates were coated with recombinant hVCAM-1 overnight at 4 C. Plates were washed and blocked for 1 h at room temperature in PBS-BSA....
J Med Chem 49: 3402-11 (2006)
Article DOI: 10.1021/jm060031q
BindingDB Entry DOI: 10.7270/Q2Z60M9V