BDBM173104 US9096589, 2-[2-(1-Cyclopentyl-4-thiophen-2-yl-1H-imidazol-2-yl)-ethyl]-5,7-dimethyl-imidazo[1,2-a]pyrimidine
SMILES: Cc1cc(C)n2cc(CCc3nc(cn3C3CCCC3)-c3cccs3)nc2n1
InChI Key: InChIKey=WSORBXYXPNLEST-UHFFFAOYSA-N
Data: 1 IC50
Activity Spreadsheet -- Enzyme Inhibition Constant Data from BindingDB
Found 1 hit for monomerid = 173104
Trg + Lig
Ki
nM
ΔG°
kcal/mole
IC50
nM
Kd
nM
EC50/IC50
nM
koff
s-1
kon
M-1s-1
pHTemp
°C
cAMP and cAMP-inhibited cGMP 3',5'-cyclic phosphodiesterase 10A
(Homo sapiens (Human))
BDBM173104
(US9096589, 2-[2-(1-Cyclopentyl-4-thiophen-2-yl-1H-...)
Show SMILES Cc1cc(C)n2cc(CCc3nc(cn3C3CCCC3)-c3cccs3)nc2n1
Show InChI InChI=1S/C22H25N5S/c1-15-12-16(2)26-13-17(24-22(26)23-15)9-10-21-25-19(20-8-5-11-28-20)14-27(21)18-6-3-4-7-18/h5,8,11-14,18H,3-4,6-7,9-10H2,1-2H3
Reactome pathway
US Patent
n/an/a 46n/an/an/an/an/a25
H. Lundbeck A/S
US Patent
Assay Description
A PDE10A assay may for example, be performed as follows: The assay is performed in 60 uL samples containing a fixed amount of the relevant PDE enzyme...
US Patent US9096589 (2015)
BindingDB Entry DOI: 10.7270/Q25Q4TTM