BDBM173255 US10323032, Example 7::US9096596, 7::US9604982, Example 7
SMILES: Clc1cccc(C(=O)N2CCc3c(C2)ncnc3-c2ccn[nH]2)c1Cl
InChI Key: InChIKey=NTUQVIQEPHGASW-UHFFFAOYSA-N
Data: 10 KI  11 IC50
Activity Spreadsheet -- Enzyme Inhibition Constant Data from BindingDB
Found 21 hits for monomerid = 173255
Trg + Lig
Ki
nM
ΔG°
kcal/mole
IC50
nM
Kd
nM
EC50/IC50
nM
koff
s-1
kon
M-1s-1
pHTemp
°C
P2X purinoceptor 7 (P2X7)
(Rattus norvegicus (Rat))
BDBM173255
(US10323032, Example 7 | US9096596, 7 | US9604982, ...)
Show SMILES Clc1cccc(C(=O)N2CCc3c(C2)ncnc3-c2ccn[nH]2)c1Cl
Show InChI InChI=1S/C17H13Cl2N5O/c18-12-3-1-2-11(15(12)19)17(25)24-7-5-10-14(8-24)20-9-21-16(10)13-4-6-22-23-13/h1-4,6,9H,5,7-8H2,(H,22,23)
US Patent
14.5n/an/an/an/an/an/an/an/a
JANSSEN PHARMACEUTICA NV
US Patent
Assay Description
human or rat P2X7-1321N1 cells were collected and frozen @ −80° C. On the day of the experiment, cell membrane preparations were made according...
US Patent US9096596 (2015)
BindingDB Entry DOI: 10.7270/Q2SJ1JC6
P2X purinoceptor 7
(Rattus norvegicus (Rat))
BDBM173255
(US10323032, Example 7 | US9096596, 7 | US9604982, ...)
Show SMILES Clc1cccc(C(=O)N2CCc3c(C2)ncnc3-c2ccn[nH]2)c1Cl
Show InChI InChI=1S/C17H13Cl2N5O/c18-12-3-1-2-11(15(12)19)17(25)24-7-5-10-14(8-24)20-9-21-16(10)13-4-6-22-23-13/h1-4,6,9H,5,7-8H2,(H,22,23)
US Patent
14.5n/an/an/an/an/an/an/an/a
Universita degli Studi di Milano
Assay Description
Human or rat P2X7-1321 N1 cells were collected and frozen @−80° C. On the day of the experiment, cell membrane preparations were made according...
Bioorg Med Chem 17: 5834-56 (2009)
BindingDB Entry DOI: 10.7270/Q21Z46SW
P2X purinoceptor 7 (P2X7)
(Rattus norvegicus (Rat))
BDBM173255
(US10323032, Example 7 | US9096596, 7 | US9604982, ...)
Show SMILES Clc1cccc(C(=O)N2CCc3c(C2)ncnc3-c2ccn[nH]2)c1Cl
Show InChI InChI=1S/C17H13Cl2N5O/c18-12-3-1-2-11(15(12)19)17(25)24-7-5-10-14(8-24)20-9-21-16(10)13-4-6-22-23-13/h1-4,6,9H,5,7-8H2,(H,22,23)
US Patent
14.5n/an/an/an/an/an/an/an/a
Janssen Pharmaceutica NV
US Patent
Assay Description
1321N1 cells expressing the recombinant human or rat P2X7 channel was cultured in HyQ DME/(HyClone/Dulbecco's Modified Eagle Medium) high glucose...
US Patent US9604982 (2017)
BindingDB Entry DOI: 10.7270/Q2B56MTX
P2X purinoceptor 7 (P2X7)
(Rattus norvegicus (Rat))
BDBM173255
(US10323032, Example 7 | US9096596, 7 | US9604982, ...)
Show SMILES Clc1cccc(C(=O)N2CCc3c(C2)ncnc3-c2ccn[nH]2)c1Cl
Show InChI InChI=1S/C17H13Cl2N5O/c18-12-3-1-2-11(15(12)19)17(25)24-7-5-10-14(8-24)20-9-21-16(10)13-4-6-22-23-13/h1-4,6,9H,5,7-8H2,(H,22,23)
US Patent
14.5n/an/an/an/an/an/an/an/a
Janssen Pharmaceutica NV
US Patent
Assay Description
1321N1 cells expressing the recombinant human or rat P2X7 channel was cultured in HyQ DME/(HyClone/Dulbecco's Modified Eagle Medium) high glucose...
US Patent US9604982 (2017)
BindingDB Entry DOI: 10.7270/Q2B56MTX
P2X purinoceptor 7
(Homo sapiens (Human))
BDBM173255
(US10323032, Example 7 | US9096596, 7 | US9604982, ...)
Show SMILES Clc1cccc(C(=O)N2CCc3c(C2)ncnc3-c2ccn[nH]2)c1Cl
Show InChI InChI=1S/C17H13Cl2N5O/c18-12-3-1-2-11(15(12)19)17(25)24-7-5-10-14(8-24)20-9-21-16(10)13-4-6-22-23-13/h1-4,6,9H,5,7-8H2,(H,22,23)
15n/an/an/an/an/an/an/an/a
Therachem Research Medilab (India) Pvt. Ltd.
Curated by ChEMBL
Assay Description
Displacement of [3H]A-804598 from human recombinant ATP-gated P2X7 receptor expressed in human 1321N1 cells after 1 hr by radioligand binding assay
ACS Med Chem Lett 7: 348-50 (2016)
BindingDB Entry DOI: 10.7270/Q2CZ392F
P2X purinoceptor 7 (P2X7)
(Rattus norvegicus (Rat))
BDBM173255
(US10323032, Example 7 | US9096596, 7 | US9604982, ...)
Show SMILES Clc1cccc(C(=O)N2CCc3c(C2)ncnc3-c2ccn[nH]2)c1Cl
Show InChI InChI=1S/C17H13Cl2N5O/c18-12-3-1-2-11(15(12)19)17(25)24-7-5-10-14(8-24)20-9-21-16(10)13-4-6-22-23-13/h1-4,6,9H,5,7-8H2,(H,22,23)
15n/an/an/an/an/an/an/an/a
Therachem Research Medilab (India) Pvt. Ltd.
Curated by ChEMBL
Assay Description
Displacement of [3H]A-804598 from rat recombinant ATP-gated P2X7 receptor expressed in human 1321N1 cells after 1 hr by radioligand binding assay
ACS Med Chem Lett 7: 348-50 (2016)
BindingDB Entry DOI: 10.7270/Q2CZ392F
P2X purinoceptor 7
(Homo sapiens (Human))
BDBM173255
(US10323032, Example 7 | US9096596, 7 | US9604982, ...)
Show SMILES Clc1cccc(C(=O)N2CCc3c(C2)ncnc3-c2ccn[nH]2)c1Cl
Show InChI InChI=1S/C17H13Cl2N5O/c18-12-3-1-2-11(15(12)19)17(25)24-7-5-10-14(8-24)20-9-21-16(10)13-4-6-22-23-13/h1-4,6,9H,5,7-8H2,(H,22,23)
US Patent
15.4n/an/an/an/an/an/an/an/a
Janssen Pharmaceutica NV
US Patent
Assay Description
Human or rat P2X7-1321N1 cells were collected and frozen @ −80° C. On the day of the experiment, cell membrane preparations were made according...
US Patent US9604982 (2017)
BindingDB Entry DOI: 10.7270/Q2B56MTX
P2X purinoceptor 7
(Homo sapiens (Human))
BDBM173255
(US10323032, Example 7 | US9096596, 7 | US9604982, ...)
Show SMILES Clc1cccc(C(=O)N2CCc3c(C2)ncnc3-c2ccn[nH]2)c1Cl
Show InChI InChI=1S/C17H13Cl2N5O/c18-12-3-1-2-11(15(12)19)17(25)24-7-5-10-14(8-24)20-9-21-16(10)13-4-6-22-23-13/h1-4,6,9H,5,7-8H2,(H,22,23)
US Patent
15.4n/an/an/an/an/an/an/an/a
JANSSEN PHARMACEUTICA NV
US Patent
Assay Description
human or rat P2X7-1321N1 cells were collected and frozen @ −80° C. On the day of the experiment, cell membrane preparations were made according...
US Patent US9096596 (2015)
BindingDB Entry DOI: 10.7270/Q2SJ1JC6
P2X purinoceptor 7
(Homo sapiens (Human))
BDBM173255
(US10323032, Example 7 | US9096596, 7 | US9604982, ...)
Show SMILES Clc1cccc(C(=O)N2CCc3c(C2)ncnc3-c2ccn[nH]2)c1Cl
Show InChI InChI=1S/C17H13Cl2N5O/c18-12-3-1-2-11(15(12)19)17(25)24-7-5-10-14(8-24)20-9-21-16(10)13-4-6-22-23-13/h1-4,6,9H,5,7-8H2,(H,22,23)
US Patent
15.4n/an/an/an/an/an/an/an/a
Universita degli Studi di Milano
Assay Description
Human or rat P2X7-1321 N1 cells were collected and frozen @−80° C. On the day of the experiment, cell membrane preparations were made according...
Bioorg Med Chem 17: 5834-56 (2009)
BindingDB Entry DOI: 10.7270/Q21Z46SW
P2X purinoceptor 7
(Homo sapiens (Human))
BDBM173255
(US10323032, Example 7 | US9096596, 7 | US9604982, ...)
Show SMILES Clc1cccc(C(=O)N2CCc3c(C2)ncnc3-c2ccn[nH]2)c1Cl
Show InChI InChI=1S/C17H13Cl2N5O/c18-12-3-1-2-11(15(12)19)17(25)24-7-5-10-14(8-24)20-9-21-16(10)13-4-6-22-23-13/h1-4,6,9H,5,7-8H2,(H,22,23)
US Patent
15.4n/an/an/an/an/an/an/an/a
Janssen Pharmaceutica NV
US Patent
Assay Description
Human or rat P2X7-1321N1 cells were collected and frozen @ −80° C. On the day of the experiment, cell membrane preparations were made according...
US Patent US9604982 (2017)
BindingDB Entry DOI: 10.7270/Q2B56MTX
P2X purinoceptor 7 (P2X7)
(Rattus norvegicus (Rat))
BDBM173255
(US10323032, Example 7 | US9096596, 7 | US9604982, ...)
Show SMILES Clc1cccc(C(=O)N2CCc3c(C2)ncnc3-c2ccn[nH]2)c1Cl
Show InChI InChI=1S/C17H13Cl2N5O/c18-12-3-1-2-11(15(12)19)17(25)24-7-5-10-14(8-24)20-9-21-16(10)13-4-6-22-23-13/h1-4,6,9H,5,7-8H2,(H,22,23)
US Patent
n/an/a 489n/an/an/an/an/an/a
Janssen Pharmaceutica NV
US Patent
Assay Description
Human or rat P2X7-1321N1 cells were collected and frozen @ −80° C. On the day of the experiment, cell membrane preparations were made according...
US Patent US9604982 (2017)
BindingDB Entry DOI: 10.7270/Q2B56MTX
P2X purinoceptor 7 (P2X7)
(Rattus norvegicus (Rat))
BDBM173255
(US10323032, Example 7 | US9096596, 7 | US9604982, ...)
Show SMILES Clc1cccc(C(=O)N2CCc3c(C2)ncnc3-c2ccn[nH]2)c1Cl
Show InChI InChI=1S/C17H13Cl2N5O/c18-12-3-1-2-11(15(12)19)17(25)24-7-5-10-14(8-24)20-9-21-16(10)13-4-6-22-23-13/h1-4,6,9H,5,7-8H2,(H,22,23)
US Patent
n/an/a 489n/an/an/an/a7.4n/a
JANSSEN PHARMACEUTICA NV
US Patent
Assay Description
1321N1 cells expressing the recombinant human, rat or mouse P2X7 channel was cultured in HyQ DME/(HyClone/Dulbecco's Modified Eagle Medium) high gluc...
US Patent US9096596 (2015)
BindingDB Entry DOI: 10.7270/Q2SJ1JC6
P2X purinoceptor 7
(Homo sapiens (Human))
BDBM173255
(US10323032, Example 7 | US9096596, 7 | US9604982, ...)
Show SMILES Clc1cccc(C(=O)N2CCc3c(C2)ncnc3-c2ccn[nH]2)c1Cl
Show InChI InChI=1S/C17H13Cl2N5O/c18-12-3-1-2-11(15(12)19)17(25)24-7-5-10-14(8-24)20-9-21-16(10)13-4-6-22-23-13/h1-4,6,9H,5,7-8H2,(H,22,23)
US Patent
n/an/a 20.7n/an/an/an/a7.4n/a
JANSSEN PHARMACEUTICA NV
US Patent
Assay Description
1321N1 cells expressing the recombinant human, rat or mouse P2X7 channel was cultured in HyQ DME/(HyClone/Dulbecco's Modified Eagle Medium) high gluc...
US Patent US9096596 (2015)
BindingDB Entry DOI: 10.7270/Q2SJ1JC6
P2X purinoceptor 7
(Rattus norvegicus (Rat))
BDBM173255
(US10323032, Example 7 | US9096596, 7 | US9604982, ...)
Show SMILES Clc1cccc(C(=O)N2CCc3c(C2)ncnc3-c2ccn[nH]2)c1Cl
Show InChI InChI=1S/C17H13Cl2N5O/c18-12-3-1-2-11(15(12)19)17(25)24-7-5-10-14(8-24)20-9-21-16(10)13-4-6-22-23-13/h1-4,6,9H,5,7-8H2,(H,22,23)
US Patent
n/an/a 489n/an/an/an/an/an/a
Universita degli Studi di Milano
Assay Description
1321N1 cells expressing the recombinant human or rat P2X7 channel was cultured in HyQ DME/(HyClone/Dulbecco's Modified Eagle Medium) high glucose...
Bioorg Med Chem 17: 5834-56 (2009)
BindingDB Entry DOI: 10.7270/Q21Z46SW
P2X purinoceptor 7
(Homo sapiens (Human))
BDBM173255
(US10323032, Example 7 | US9096596, 7 | US9604982, ...)
Show SMILES Clc1cccc(C(=O)N2CCc3c(C2)ncnc3-c2ccn[nH]2)c1Cl
Show InChI InChI=1S/C17H13Cl2N5O/c18-12-3-1-2-11(15(12)19)17(25)24-7-5-10-14(8-24)20-9-21-16(10)13-4-6-22-23-13/h1-4,6,9H,5,7-8H2,(H,22,23)
US Patent
n/an/a 20.7n/an/an/an/an/an/a
Janssen Pharmaceutica NV
US Patent
Assay Description
1321N1 cells expressing the recombinant human or rat P2X7 channel was cultured in HyQ DME/(HyClone/Dulbecco's Modified Eagle Medium) high glucose...
US Patent US9604982 (2017)
BindingDB Entry DOI: 10.7270/Q2B56MTX
P2X purinoceptor 7
(Homo sapiens (Human))
BDBM173255
(US10323032, Example 7 | US9096596, 7 | US9604982, ...)
Show SMILES Clc1cccc(C(=O)N2CCc3c(C2)ncnc3-c2ccn[nH]2)c1Cl
Show InChI InChI=1S/C17H13Cl2N5O/c18-12-3-1-2-11(15(12)19)17(25)24-7-5-10-14(8-24)20-9-21-16(10)13-4-6-22-23-13/h1-4,6,9H,5,7-8H2,(H,22,23)
US Patent
n/an/a 20.7n/an/an/an/an/an/a
Universita degli Studi di Milano
Assay Description
1321N1 cells expressing the recombinant human or rat P2X7 channel was cultured in HyQ DME/(HyClone/Dulbecco's Modified Eagle Medium) high glucose...
Bioorg Med Chem 17: 5834-56 (2009)
BindingDB Entry DOI: 10.7270/Q21Z46SW
P2X purinoceptor 7
(Homo sapiens (Human))
BDBM173255
(US10323032, Example 7 | US9096596, 7 | US9604982, ...)
Show SMILES Clc1cccc(C(=O)N2CCc3c(C2)ncnc3-c2ccn[nH]2)c1Cl
Show InChI InChI=1S/C17H13Cl2N5O/c18-12-3-1-2-11(15(12)19)17(25)24-7-5-10-14(8-24)20-9-21-16(10)13-4-6-22-23-13/h1-4,6,9H,5,7-8H2,(H,22,23)
US Patent
n/an/a 20.7n/an/an/an/an/an/a
Janssen Pharmaceutica NV
US Patent
Assay Description
1321N1 cells expressing the recombinant human or rat P2X7 channel was cultured in HyQ DME/(HyClone/Dulbecco's Modified Eagle Medium) high glucose...
US Patent US9604982 (2017)
BindingDB Entry DOI: 10.7270/Q2B56MTX
P2X purinoceptor 7
(Homo sapiens (Human))
BDBM173255
(US10323032, Example 7 | US9096596, 7 | US9604982, ...)
Show SMILES Clc1cccc(C(=O)N2CCc3c(C2)ncnc3-c2ccn[nH]2)c1Cl
Show InChI InChI=1S/C17H13Cl2N5O/c18-12-3-1-2-11(15(12)19)17(25)24-7-5-10-14(8-24)20-9-21-16(10)13-4-6-22-23-13/h1-4,6,9H,5,7-8H2,(H,22,23)
n/an/a 562n/an/an/an/an/an/a
Therachem Research Medilab (India) Pvt. Ltd.
Curated by ChEMBL
Assay Description
Antagonist activity against ATP-gated P2X7 receptor in LPS-stimulated human whole blood assessed as reduction in P2X7 agonist 2'(3')-O-(4-benzoylbenz...
ACS Med Chem Lett 7: 348-50 (2016)
BindingDB Entry DOI: 10.7270/Q2CZ392F
P2X purinoceptor 7 (P2X7)
(Rattus norvegicus (Rat))
BDBM173255
(US10323032, Example 7 | US9096596, 7 | US9604982, ...)
Show SMILES Clc1cccc(C(=O)N2CCc3c(C2)ncnc3-c2ccn[nH]2)c1Cl
Show InChI InChI=1S/C17H13Cl2N5O/c18-12-3-1-2-11(15(12)19)17(25)24-7-5-10-14(8-24)20-9-21-16(10)13-4-6-22-23-13/h1-4,6,9H,5,7-8H2,(H,22,23)
n/an/a 489n/an/an/an/an/an/a
Therachem Research Medilab (India) Pvt. Ltd.
Curated by ChEMBL
Assay Description
Antagonist activity against rat recombinant ATP-gated P2X7 receptor expressed in human 1321N1 cells assessed as reduction in BzATP -induced Ca2+ flux...
ACS Med Chem Lett 7: 348-50 (2016)
BindingDB Entry DOI: 10.7270/Q2CZ392F
P2X purinoceptor 7
(Homo sapiens (Human))
BDBM173255
(US10323032, Example 7 | US9096596, 7 | US9604982, ...)
Show SMILES Clc1cccc(C(=O)N2CCc3c(C2)ncnc3-c2ccn[nH]2)c1Cl
Show InChI InChI=1S/C17H13Cl2N5O/c18-12-3-1-2-11(15(12)19)17(25)24-7-5-10-14(8-24)20-9-21-16(10)13-4-6-22-23-13/h1-4,6,9H,5,7-8H2,(H,22,23)
n/an/a 21n/an/an/an/an/an/a
Therachem Research Medilab (India) Pvt. Ltd.
Curated by ChEMBL
Assay Description
Antagonist activity against human recombinant ATP-gated P2X7 receptor expressed in human 1321N1 cells assessed as reduction in BzATP -induced Ca2+ fl...
ACS Med Chem Lett 7: 348-50 (2016)
BindingDB Entry DOI: 10.7270/Q2CZ392F
P2X purinoceptor 7 (P2X7)
(Rattus norvegicus (Rat))
BDBM173255
(US10323032, Example 7 | US9096596, 7 | US9604982, ...)
Show SMILES Clc1cccc(C(=O)N2CCc3c(C2)ncnc3-c2ccn[nH]2)c1Cl
Show InChI InChI=1S/C17H13Cl2N5O/c18-12-3-1-2-11(15(12)19)17(25)24-7-5-10-14(8-24)20-9-21-16(10)13-4-6-22-23-13/h1-4,6,9H,5,7-8H2,(H,22,23)
US Patent
n/an/a 489n/an/an/an/an/an/a
Janssen Pharmaceutica NV
US Patent
Assay Description
Human or rat P2X7-1321N1 cells were collected and frozen @ −80° C. On the day of the experiment, cell membrane preparations were made according...
US Patent US9604982 (2017)
BindingDB Entry DOI: 10.7270/Q2B56MTX