BDBM174271 US9688669, Example 103
SMILES: O[C@H]1C[C@H](C1)C#Cc1cncc(c1)[C@H]1NC(=O)O[C@@H]1c1cccc(F)c1
InChI Key: InChIKey=IZDJAZZKINJIGM-YJQAKTFBSA-N
Data: 1 KI  2 EC50
Activity Spreadsheet -- Enzyme Inhibition Constant Data from BindingDB
Found 3 hits for monomerid = 174271
Trg + Lig
Ki
nM
ΔG°
kcal/mole
IC50
nM
Kd
nM
EC50/IC50
nM
koff
s-1
kon
M-1s-1
pHTemp
°C
Metabotropic glutamate receptor 5
(Homo sapiens (Human))
BDBM174271
(US9688669, Example 103)
Show SMILES O[C@H]1C[C@H](C1)C#Cc1cncc(c1)[C@H]1NC(=O)O[C@@H]1c1cccc(F)c1 |r,wU:13.14,3.5,1.0,wD:18.21,(-7.49,4.51,;-6.15,3.74,;-4.66,4.14,;-4.27,2.65,;-5.75,2.26,;-2.93,1.88,;-1.6,1.11,;-.26,.34,;-.26,-1.2,;1.07,-1.97,;2.4,-1.2,;2.4,.34,;1.07,1.11,;3.74,1.11,;3.74,2.65,;5.2,3.13,;5.97,4.46,;6.11,1.88,;5.2,.64,;5.6,-.85,;7.09,-1.25,;7.49,-2.73,;6.4,-3.82,;4.91,-3.42,;3.82,-4.51,;4.51,-1.94,)|
Show InChI InChI=1S/C20H17FN2O3/c21-16-3-1-2-14(9-16)19-18(23-20(25)26-19)15-6-13(10-22-11-15)5-4-12-7-17(24)8-12/h1-3,6,9-12,17-19,24H,7-8H2,(H,23,25)/t12-,17+,18-,19-/m1/s1
710n/an/an/an/an/an/an/an/a
Bristol-Myers Squibb Co.
Curated by ChEMBL
Assay Description
Displacement of [3H]MPEPy from human mGluR5 expressed in cell membranes after 60 mins by liquid scintillation counting method
Bioorg Med Chem Lett 26: 5871-5876 (2016)
Article DOI: 10.1016/j.bmcl.2016.11.014
BindingDB Entry DOI: 10.7270/Q2SB47RG
Metabotropic glutamate receptor 5
(Homo sapiens (Human))
BDBM174271
(US9688669, Example 103)
Show SMILES O[C@H]1C[C@H](C1)C#Cc1cncc(c1)[C@H]1NC(=O)O[C@@H]1c1cccc(F)c1 |r,wU:13.14,3.5,1.0,wD:18.21,(-7.49,4.51,;-6.15,3.74,;-4.66,4.14,;-4.27,2.65,;-5.75,2.26,;-2.93,1.88,;-1.6,1.11,;-.26,.34,;-.26,-1.2,;1.07,-1.97,;2.4,-1.2,;2.4,.34,;1.07,1.11,;3.74,1.11,;3.74,2.65,;5.2,3.13,;5.97,4.46,;6.11,1.88,;5.2,.64,;5.6,-.85,;7.09,-1.25,;7.49,-2.73,;6.4,-3.82,;4.91,-3.42,;3.82,-4.51,;4.51,-1.94,)|
Show InChI InChI=1S/C20H17FN2O3/c21-16-3-1-2-14(9-16)19-18(23-20(25)26-19)15-6-13(10-22-11-15)5-4-12-7-17(24)8-12/h1-3,6,9-12,17-19,24H,7-8H2,(H,23,25)/t12-,17+,18-,19-/m1/s1
n/an/an/an/a 250n/an/an/an/a
Bristol-Myers Squibb Co.
Curated by ChEMBL
Assay Description
Positive allosteric modulation activity at human mGluR5A expressed in HEK293(ZF) cells co-expressing rat glutamate-aspartate transporter assessed as ...
Bioorg Med Chem Lett 26: 5871-5876 (2016)
Article DOI: 10.1016/j.bmcl.2016.11.014
BindingDB Entry DOI: 10.7270/Q2SB47RG
Metabotropic glutamate receptor 5 (mGluR5)
(Homo sapiens (Human))
BDBM174271
(US9688669, Example 103)
Show SMILES O[C@H]1C[C@H](C1)C#Cc1cncc(c1)[C@H]1NC(=O)O[C@@H]1c1cccc(F)c1 |r,wU:13.14,3.5,1.0,wD:18.21,(-7.49,4.51,;-6.15,3.74,;-4.66,4.14,;-4.27,2.65,;-5.75,2.26,;-2.93,1.88,;-1.6,1.11,;-.26,.34,;-.26,-1.2,;1.07,-1.97,;2.4,-1.2,;2.4,.34,;1.07,1.11,;3.74,1.11,;3.74,2.65,;5.2,3.13,;5.97,4.46,;6.11,1.88,;5.2,.64,;5.6,-.85,;7.09,-1.25,;7.49,-2.73,;6.4,-3.82,;4.91,-3.42,;3.82,-4.51,;4.51,-1.94,)|
Show InChI InChI=1S/C20H17FN2O3/c21-16-3-1-2-14(9-16)19-18(23-20(25)26-19)15-6-13(10-22-11-15)5-4-12-7-17(24)8-12/h1-3,6,9-12,17-19,24H,7-8H2,(H,23,25)/t12-,17+,18-,19-/m1/s1
US Patent
n/an/an/an/a 251n/an/an/an/a
Bristol-Myers Squibb Company
US Patent
Assay Description
HEK293 (ZF) cells stably transfected with human mGluR5A (pIRES neo) and the rat glutamate-aspartate transporter (GLAST; pIRES puro) are grown in a mo...
US Patent US9688669 (2017)
BindingDB Entry DOI: 10.7270/Q25T3HN9