BDBM175524 US9119845, 25
SMILES: OC[C@@H]1[C@@H](O)[C@H](O)CCN1Cc1ccc(cc1)[N+]([O-])=O
InChI Key: InChIKey=HRFMLUWKWPJUPD-JHJVBQTASA-N
Data: 1 KI  1 IC50  1 EC50
Activity Spreadsheet -- Enzyme Inhibition Constant Data from BindingDB
Found 1 hit for monomerid = 175524
Trg + Lig
Ki
nM
ΔG°
kcal/mole
IC50
nM
Kd
nM
EC50/IC50
nM
koff
s-1
kon
M-1s-1
pHTemp
°C
Beta-glucocerebrosidase
(Mus musculus (Mouse))
BDBM175524
(US9119845, 25)
Show SMILES OC[C@@H]1[C@@H](O)[C@H](O)CCN1Cc1ccc(cc1)[N+]([O-])=O |r|
Show InChI InChI=1S/C13H18N2O5/c16-8-11-13(18)12(17)5-6-14(11)7-9-1-3-10(4-2-9)15(19)20/h1-4,11-13,16-18H,5-8H2/t11-,12-,13-/m1/s1
US Patent
1.86E+4n/a 4.50E+4n/a 1.64E+4n/an/a4.5n/a
Amicus Therapeautics, Inc.
US Patent
Assay Description
To 2.5 μl of supernatant (in 96-well plates) was added 17.5 μl reaction buffer (citrate phosphate buffer, pH 4.5, no Triton X-100), and 50 ...
US Patent US9119845 (2015)
BindingDB Entry DOI: 10.7270/Q2V40T0P