BDBM17785 2-aminoquinazoline, 3::4-(2-amino-6-phenoxy-3,4-dihydroquinazolin-3-yl)-N,4-dicyclohexyl-N-methylbutanamide
SMILES: CN(C1CCCCC1)C(=O)CCC(C1CCCCC1)N1Cc2cc(Oc3ccccc3)ccc2N=C1N
InChI Key: InChIKey=JKQCQYBXDQPJNC-UHFFFAOYSA-N
Data: 1 KI
PDB links: 1 PDB ID matches this monomer. 1 PDB ID contains this monomer as substructures. 1 PDB ID contains inhibitors having a similarity of 90% to this monomer.
Activity Spreadsheet -- Enzyme Inhibition Constant Data from BindingDB
Found 1 hit for monomerid = 17785
Trg + Lig
Ki
nM
ΔG°
kcal/mole
IC50
nM
Kd
nM
EC50/IC50
nM
koff
s-1
kon
M-1s-1
pHTemp
°C
Beta-secretase 1
(Homo sapiens (Human))
BDBM17785
(2-aminoquinazoline, 3 | 4-(2-amino-6-phenoxy-3,4-d...)
Show SMILES CN(C1CCCCC1)C(=O)CCC(C1CCCCC1)N1Cc2cc(Oc3ccccc3)ccc2N=C1N |c:38|
Show InChI InChI=1S/C31H42N4O2/c1-34(25-13-7-3-8-14-25)30(36)20-19-29(23-11-5-2-6-12-23)35-22-24-21-27(17-18-28(24)33-31(35)32)37-26-15-9-4-10-16-26/h4,9-10,15-18,21,23,25,29H,2-3,5-8,11-14,19-20,22H2,1H3,(H2,32,33)
30 -10.2n/an/an/an/an/a5.022
Johnson & Johnson Pharmaceutical
Assay Description
BACE-1 activity was measured at pH 5 using the FS1 FRET substrate. Compounds were preincubated with recombinant BACE-1 for 20 min before adding subst...
J Med Chem 50: 4261-4 (2007)
Article DOI: 10.1021/jm0705408
BindingDB Entry DOI: 10.7270/Q24M92T2
3D
3D Structure (crystal)