BDBM17876 Ketoamide inhibitor, 5::tert-butyl N-{1-[(1R,5S)-2-[(1-carbamoyl-1-oxopentan-2-yl)carbamoyl]-6,6-dimethyl-3-azabicyclo[3.1.0]hexan-3-yl]-3,3-dimethyl-1-oxobutan-2-yl}carbamate
SMILES: CCCC(NC(=O)C1[C@@H]2[C@H](CN1C(=O)C(NC(=O)OC(C)(C)C)C(C)(C)C)C2(C)C)C(=O)C(N)=O
InChI Key: InChIKey=XWQBVLITARLWBM-ADEOBCBWSA-N
Data: 1 KI
PDB links: 2 PDB IDs contain this monomer as substructures. 2 PDB IDs contain inhibitors having a similarity of 90% to this monomer.
Activity Spreadsheet -- Enzyme Inhibition Constant Data from BindingDB
Found 1 hit for monomerid = 17876
Trg + Lig
Ki
nM
ΔG°
kcal/mole
IC50
nM
Kd
nM
EC50/IC50
nM
koff
s-1
kon
M-1s-1
pHTemp
°C
HCV NS3-NS4A Serine Proteinase
(Hepatitis C virus (HCV genotype 1a, isolate H))
BDBM17876
(Ketoamide inhibitor, 5 | tert-butyl N-{1-[(1R,5S)-...)
Show SMILES CCCC(NC(=O)C1[C@@H]2[C@H](CN1C(=O)C(NC(=O)OC(C)(C)C)C(C)(C)C)C2(C)C)C(=O)C(N)=O |r|
Show InChI InChI=1S/C25H42N4O6/c1-10-11-14(17(30)19(26)31)27-20(32)16-15-13(25(15,8)9)12-29(16)21(33)18(23(2,3)4)28-22(34)35-24(5,6)7/h13-16,18H,10-12H2,1-9H3,(H2,26,31)(H,27,32)(H,28,34)/t13-,14?,15-,16?,18?/m0/s1
220 -9.23n/an/an/an/an/a6.530
Schering-Plough Research Institute
Assay Description
Proteolytic cleavage of the ester linkage between the Nva (L-norvaline) and the chromophore (PAP) was monitored for change in absorbance at 370 nm. I...
J Med Chem 50: 2310-8 (2007)
Article DOI: 10.1021/jm060173k
BindingDB Entry DOI: 10.7270/Q27D2SDK