null
SMILES: CC(C)(C)CC(NC(=O)C1[C@@H]2[C@H](CN1C(=O)C(NC(=O)OC(C)(C)C)C(C)(C)C)C2(C)C)C(=O)C(N)=O
InChI Key: InChIKey=ZLMCOZNQHMOQQG-XAVVCJAESA-N
Activity Spreadsheet -- Enzyme Inhibition Constant Data from BindingDB
Found 1 hit for monomerid = 17879
Trg + Lig
Ki
nM
ΔG°
kcal/mole
IC50
nM
Kd
nM
EC50/IC50
nM
koff
s-1
kon
M-1s-1
pHTemp
°C
Genome polyprotein
(Hepatitis C virus (HCV genotype 1a, isolate H))
BDBM17879
(Ketoamide inhibitor, 9 | tert-butyl N-{1-[(1R,5S)-...)
Show SMILES CC(C)(C)CC(NC(=O)C1[C@@H]2[C@H](CN1C(=O)C(NC(=O)OC(C)(C)C)C(C)(C)C)C2(C)C)C(=O)C(N)=O |r|
Show InChI InChI=1S/C27H46N4O6/c1-24(2,3)12-15(18(32)20(28)33)29-21(34)17-16-14(27(16,10)11)13-31(17)22(35)19(25(4,5)6)30-23(36)37-26(7,8)9/h14-17,19H,12-13H2,1-11H3,(H2,28,33)(H,29,34)(H,30,36)/t14-,15?,16-,17?,19?/m0/s1
>3.30E+3>-7.60n/an/an/an/an/a6.530
Schering-Plough Research Institute
Assay Description
Proteolytic cleavage of the ester linkage between the Nva (L-norvaline) and the chromophore (PAP) was monitored for change in absorbance at 370 nm. I...
J Med Chem 50: 2310-8 (2007)
Article DOI: 10.1021/jm060173k
BindingDB Entry DOI: 10.7270/Q27D2SDK