BDBM179771 2-(20,50-Dihydroxyphenyl)-7-methyl-1H-benzo[d]imidazole (13)
SMILES: Cc1cccc2nc([nH]c12)-c1cc(O)ccc1O
InChI Key: InChIKey=UZTHIFZTRVCNBN-UHFFFAOYSA-N
Data: 2 IC50
Activity Spreadsheet -- Enzyme Inhibition Constant Data from BindingDB
Found 2 hits for monomerid = 179771
Trg + Lig
Ki
nM
ΔG°
kcal/mole
IC50
nM
Kd
nM
EC50/IC50
nM
koff
s-1
kon
M-1s-1
pHTemp
°C
Probable maltase-glucoamylase 2
(Homo sapiens)
BDBM179771
(2-(20,50-Dihydroxyphenyl)-7-methyl-1H-benzo[d]imid...)
Show SMILES Cc1cccc2nc([nH]c12)-c1cc(O)ccc1O
Show InChI InChI=1S/C14H12N2O2/c1-8-3-2-4-11-13(8)16-14(15-11)10-7-9(17)5-6-12(10)18/h2-7,17-18H,1H3,(H,15,16)
n/an/a 5.30E+3n/an/an/an/an/an/a
Babasaheb Bhimrao Ambedkar University (A Central University)
Curated by ChEMBL
Assay Description
Inhibition of alpha-glucosidase (unknown origin) using pNPG as substrate preincubated for 15 mins followed by substrate addition
Eur J Med Chem 176: 343-377 (2019)
Article DOI: 10.1016/j.ejmech.2019.04.025
α-glucosidase
(Saccharomyces cerevisiae S288c (Baker's yeast))
BDBM179771
(2-(20,50-Dihydroxyphenyl)-7-methyl-1H-benzo[d]imid...)
Show SMILES Cc1cccc2nc([nH]c12)-c1cc(O)ccc1O
Show InChI InChI=1S/C14H12N2O2/c1-8-3-2-4-11-13(8)16-14(15-11)10-7-9(17)5-6-12(10)18/h2-7,17-18H,1H3,(H,15,16)
Reactome pathway
n/an/a 1.25E+5n/an/an/an/an/an/a
Universiti Teknologi MARA (UiTM), Puncak Alam Campus
Assay Description
The 135 µL of 50 mM phosphate saline buffer pH (6.8), solution of enzyme (20 µL), and 20 µL of test sample with 70% DMSO was added to 96-well plate. ...
Bioorg Chem 65: 100-9 (2016)
Article DOI: 10.1016/j.bioorg.2016.02.004
BindingDB Entry DOI: 10.7270/Q24B303S