BDBM189381 3-((1-phenyl-1H-1,2,3-triazol-4-yl)methyl)oxazolo[4,5-b]pyridin-2(3H)-one (4a)
SMILES: O=c1oc2cccnc2n1Cc1cn(nn1)-c1ccccc1
InChI Key: InChIKey=QQSQZEMGQCSFAS-UHFFFAOYSA-N
Data: 1 IC50
Activity Spreadsheet -- Enzyme Inhibition Constant Data from BindingDB
Found 1 hit for monomerid = 189381
Trg + Lig
Ki
nM
ΔG°
kcal/mole
IC50
nM
Kd
nM
EC50/IC50
nM
koff
s-1
kon
M-1s-1
pHTemp
°C
Glycogen synthase kinase-3 beta
(Homo sapiens (Human))
BDBM189381
(3-((1-phenyl-1H-1,2,3-triazol-4-yl)methyl)oxazolo[...)
Show SMILES O=c1oc2cccnc2n1Cc1cn(nn1)-c1ccccc1
Show InChI InChI=1S/C15H11N5O2/c21-15-19(14-13(22-15)7-4-8-16-14)9-11-10-20(18-17-11)12-5-2-1-3-6-12/h1-8,10H,9H2
NCI pathway
Reactome pathway
n/an/a 1.01E+4n/an/an/an/an/a30
Hamdard University (Jamia Hamdard)
Assay Description
In a typical assay, 10 µL of test compound of different concentrations (dissolvedin dimethyl sulfoxide [DMSO] and diluted with assay buffer) and 10 µ...
Chem Biol Drug Des 87: 918-26 (2016)
Article DOI: 10.1111/cbdd.12724
BindingDB Entry DOI: 10.7270/Q28914NR