BDBM189384 3-((1-(pyridin-3-yl)-1H-1,2,3-triazol-4-yl)methyl)oxazolo[4,5-b]pyridin-2(3H)-one (4d)
SMILES: O=c1oc2cccnc2n1Cc1cn(nn1)-c1cccnc1
InChI Key: InChIKey=RPHDXXBVAHLJFM-UHFFFAOYSA-N
Data: 1 IC50
Activity Spreadsheet -- Enzyme Inhibition Constant Data from BindingDB
Found 1 hit for monomerid = 189384
Trg + Lig
Ki
nM
ΔG°
kcal/mole
IC50
nM
Kd
nM
EC50/IC50
nM
koff
s-1
kon
M-1s-1
pHTemp
°C
Glycogen synthase kinase-3 beta
(Homo sapiens (Human))
BDBM189384
(3-((1-(pyridin-3-yl)-1H-1,2,3-triazol-4-yl)methyl)...)
Show SMILES O=c1oc2cccnc2n1Cc1cn(nn1)-c1cccnc1
Show InChI InChI=1S/C14H10N6O2/c21-14-19(13-12(22-14)4-2-6-16-13)8-10-9-20(18-17-10)11-3-1-5-15-7-11/h1-7,9H,8H2
NCI pathway
Reactome pathway
n/an/a 230n/an/an/an/an/a30
Hamdard University (Jamia Hamdard)
Assay Description
In a typical assay, 10 µL of test compound of different concentrations (dissolvedin dimethyl sulfoxide [DMSO] and diluted with assay buffer) and 10 µ...
Chem Biol Drug Des 87: 918-26 (2016)
Article DOI: 10.1111/cbdd.12724
BindingDB Entry DOI: 10.7270/Q28914NR