BDBM189389 3-((1-(2-fluorophenyl)-1H-1,2,3-triazol-4-yl)methyl)oxazolo[4,5-b]pyridin-2(3H)-one (4i)
SMILES: Fc1ccccc1-n1cc(Cn2c3ncccc3oc2=O)nn1
InChI Key: InChIKey=UJRUHAPOICOMLD-UHFFFAOYSA-N
Data: 1 IC50
Activity Spreadsheet -- Enzyme Inhibition Constant Data from BindingDB
Found 1 hit for monomerid = 189389
Trg + Lig
Ki
nM
ΔG°
kcal/mole
IC50
nM
Kd
nM
EC50/IC50
nM
koff
s-1
kon
M-1s-1
pHTemp
°C
Glycogen synthase kinase-3 beta
(Homo sapiens (Human))
BDBM189389
(3-((1-(2-fluorophenyl)-1H-1,2,3-triazol-4-yl)methy...)
Show SMILES Fc1ccccc1-n1cc(Cn2c3ncccc3oc2=O)nn1
Show InChI InChI=1S/C15H10FN5O2/c16-11-4-1-2-5-12(11)21-9-10(18-19-21)8-20-14-13(23-15(20)22)6-3-7-17-14/h1-7,9H,8H2
NCI pathway
Reactome pathway
n/an/a 370n/an/an/an/an/a30
Hamdard University (Jamia Hamdard)
Assay Description
In a typical assay, 10 µL of test compound of different concentrations (dissolvedin dimethyl sulfoxide [DMSO] and diluted with assay buffer) and 10 µ...
Chem Biol Drug Des 87: 918-26 (2016)
Article DOI: 10.1111/cbdd.12724
BindingDB Entry DOI: 10.7270/Q28914NR