BDBM189398 3-((1-(2,4-dichlorophenyl)-1H-1,2,3-triazol-4-yl)methyl)oxazolo[4,5-b]pyridin-2(3H)-one (4r)
SMILES: Clc1ccc(c(Cl)c1)-n1cc(Cn2c3ncccc3oc2=O)nn1
InChI Key: InChIKey=VHABVEUNOXQJPN-UHFFFAOYSA-N
Data: 1 IC50
Activity Spreadsheet -- Enzyme Inhibition Constant Data from BindingDB
Found 1 hit for monomerid = 189398
Trg + Lig
Ki
nM
ΔG°
kcal/mole
IC50
nM
Kd
nM
EC50/IC50
nM
koff
s-1
kon
M-1s-1
pHTemp
°C
Glycogen synthase kinase-3 beta
(Homo sapiens (Human))
BDBM189398
(3-((1-(2,4-dichlorophenyl)-1H-1,2,3-triazol-4-yl)m...)
Show SMILES Clc1ccc(c(Cl)c1)-n1cc(Cn2c3ncccc3oc2=O)nn1
Show InChI InChI=1S/C15H9Cl2N5O2/c16-9-3-4-12(11(17)6-9)22-8-10(19-20-22)7-21-14-13(24-15(21)23)2-1-5-18-14/h1-6,8H,7H2
NCI pathway
Reactome pathway
n/an/a 1.08E+4n/an/an/an/an/a30
Hamdard University (Jamia Hamdard)
Assay Description
In a typical assay, 10 µL of test compound of different concentrations (dissolvedin dimethyl sulfoxide [DMSO] and diluted with assay buffer) and 10 µ...
Chem Biol Drug Des 87: 918-26 (2016)
Article DOI: 10.1111/cbdd.12724
BindingDB Entry DOI: 10.7270/Q28914NR