BDBM190668 US10759791, Compound 14k::nNOS inhibitor, 6
SMILES: CN(C)CCCc1cncc(CCc2cc(C)cc(N)n2)c1
InChI Key: InChIKey=TUAXAWZDVAYXFN-UHFFFAOYSA-N
Data: 15 KI
PDB links: 4 PDB IDs match this monomer.
Activity Spreadsheet -- Enzyme Inhibition Constant Data from BindingDB
Found 15 hits for monomerid = 190668
Trg + Lig
Ki
nM
ΔG°
kcal/mole
IC50
nM
Kd
nM
EC50/IC50
nM
koff
s-1
kon
M-1s-1
pHTemp
°C
Nitric oxide synthase, endothelial
(Rattus norvegicus)
BDBM190668
(US10759791, Compound 14k | nNOS inhibitor, 6)
Show SMILES CN(C)CCCc1cncc(CCc2cc(C)cc(N)n2)c1
Show InChI InChI=1S/C18H26N4/c1-14-9-17(21-18(19)10-14)7-6-16-11-15(12-20-13-16)5-4-8-22(2)3/h9-13H,4-8H2,1-3H3,(H2,19,21)
Reactome pathway
US Patent
25n/an/an/an/an/an/an/an/a
Northwestern University
US Patent
Assay Description
Enzyme inhibition was evaluated by measuring NO production with the hemoglobin capture assay, which was performed with purified NOSs in 96-well plate...
US Patent US10759791 (2020)
3D
3D Structure (crystal)
Nitric-oxide synthase, brain
(Rattus norvegicus (rat))
BDBM190668
(US10759791, Compound 14k | nNOS inhibitor, 6)
Show SMILES CN(C)CCCc1cncc(CCc2cc(C)cc(N)n2)c1
Show InChI InChI=1S/C18H26N4/c1-14-9-17(21-18(19)10-14)7-6-16-11-15(12-20-13-16)5-4-8-22(2)3/h9-13H,4-8H2,1-3H3,(H2,19,21)
US Patent
25n/an/an/an/an/an/an/an/a
Northwestern University
US Patent
Assay Description
Enzyme inhibition was evaluated by measuring NO production with the hemoglobin capture assay, which was performed with purified NOSs in 96-well plate...
US Patent US10759791 (2020)
3D
3D Structure (crystal)
Nitric-oxide synthase, brain
(Rattus norvegicus (rat))
BDBM190668
(US10759791, Compound 14k | nNOS inhibitor, 6)
Show SMILES CN(C)CCCc1cncc(CCc2cc(C)cc(N)n2)c1
Show InChI InChI=1S/C18H26N4/c1-14-9-17(21-18(19)10-14)7-6-16-11-15(12-20-13-16)5-4-8-22(2)3/h9-13H,4-8H2,1-3H3,(H2,19,21)
25n/an/an/an/an/an/an/an/a
Northwestern University
Curated by ChEMBL
Assay Description
Inhibition of rat recombinant nNOS expressed in Escherichia coli using L-arginine as substrate assessed as reduction in NO production measured for 6 ...
J Med Chem 59: 4913-25 (2016)
BindingDB Entry DOI: 10.7270/Q2J38VHQ
3D
3D Structure (crystal)
Nitric-oxide synthase, brain
(Rattus norvegicus (rat))
BDBM190668
(US10759791, Compound 14k | nNOS inhibitor, 6)
Show SMILES CN(C)CCCc1cncc(CCc2cc(C)cc(N)n2)c1
Show InChI InChI=1S/C18H26N4/c1-14-9-17(21-18(19)10-14)7-6-16-11-15(12-20-13-16)5-4-8-22(2)3/h9-13H,4-8H2,1-3H3,(H2,19,21)
25.2 -10.8n/an/an/an/an/a7.437
University of California , Irvine
Assay Description
The assay was performed at 37 °C in HEPES buffer (100 mM, with 10% glycerol, pH 7.4) in the presence of 10 uM L-arginine. Also included were 100 ...
Biochemistry 55: 3702-7 (2016)
Article DOI: 10.1021/acs.biochem.6b00261
BindingDB Entry DOI: 10.7270/Q2WW7GFX
3D
3D Structure (crystal)
Nitric oxide synthase, brain
(Homo sapiens (Human))
BDBM190668
(US10759791, Compound 14k | nNOS inhibitor, 6)
Show SMILES CN(C)CCCc1cncc(CCc2cc(C)cc(N)n2)c1
Show InChI InChI=1S/C18H26N4/c1-14-9-17(21-18(19)10-14)7-6-16-11-15(12-20-13-16)5-4-8-22(2)3/h9-13H,4-8H2,1-3H3,(H2,19,21)
Reactome pathway
US Patent
37n/an/an/an/an/an/an/an/a
Northwestern University
US Patent
Assay Description
Enzyme inhibition was evaluated by measuring NO production with the hemoglobin capture assay, which was performed with purified NOSs in 96-well plate...
US Patent US10759791 (2020)
3D
3D Structure (crystal)
Nitric oxide synthase, brain
(Homo sapiens (Human))
BDBM190668
(US10759791, Compound 14k | nNOS inhibitor, 6)
Show SMILES CN(C)CCCc1cncc(CCc2cc(C)cc(N)n2)c1
Show InChI InChI=1S/C18H26N4/c1-14-9-17(21-18(19)10-14)7-6-16-11-15(12-20-13-16)5-4-8-22(2)3/h9-13H,4-8H2,1-3H3,(H2,19,21)
Reactome pathway
37n/an/an/an/an/an/an/an/a
Northwestern University
Curated by ChEMBL
Assay Description
Inhibition of human recombinant nNOS expressed in Escherichia coli using L-arginine as substrate assessed as reduction in NO production measured for ...
J Med Chem 59: 4913-25 (2016)
BindingDB Entry DOI: 10.7270/Q2J38VHQ
3D
3D Structure (crystal)
Nitric oxide synthase, brain
(Homo sapiens (Human))
BDBM190668
(US10759791, Compound 14k | nNOS inhibitor, 6)
Show SMILES CN(C)CCCc1cncc(CCc2cc(C)cc(N)n2)c1
Show InChI InChI=1S/C18H26N4/c1-14-9-17(21-18(19)10-14)7-6-16-11-15(12-20-13-16)5-4-8-22(2)3/h9-13H,4-8H2,1-3H3,(H2,19,21)
Reactome pathway
US Patent
37n/an/an/an/an/an/an/an/a
Northwestern University
US Patent
Assay Description
Enzyme inhibition was evaluated by measuring NO production with the hemoglobin capture assay, which was performed with purified NOSs in 96-well plate...
US Patent US10759791 (2020)
3D
3D Structure (crystal)
Nitric Oxide Synthase, brain Mutant (D597N)
(Rattus norvegicus (rat))
BDBM190668
(US10759791, Compound 14k | nNOS inhibitor, 6)
Show SMILES CN(C)CCCc1cncc(CCc2cc(C)cc(N)n2)c1
Show InChI InChI=1S/C18H26N4/c1-14-9-17(21-18(19)10-14)7-6-16-11-15(12-20-13-16)5-4-8-22(2)3/h9-13H,4-8H2,1-3H3,(H2,19,21)
97.5 -9.94n/an/an/an/an/a7.437
University of California , Irvine
Assay Description
The assay was performed at 37 °C in HEPES buffer (100 mM, with 10% glycerol, pH 7.4) in the presence of 10 uM L-arginine. Also included were 100 ...
Biochemistry 55: 3702-7 (2016)
Article DOI: 10.1021/acs.biochem.6b00261
BindingDB Entry DOI: 10.7270/Q2WW7GFX
3D
3D Structure (crystal)
Nitric oxide synthase mutant (nNOS M336V/D597N)
(Rattus norvegicus (rats))
BDBM190668
(US10759791, Compound 14k | nNOS inhibitor, 6)
Show SMILES CN(C)CCCc1cncc(CCc2cc(C)cc(N)n2)c1
Show InChI InChI=1S/C18H26N4/c1-14-9-17(21-18(19)10-14)7-6-16-11-15(12-20-13-16)5-4-8-22(2)3/h9-13H,4-8H2,1-3H3,(H2,19,21)
108 -9.88n/an/an/an/an/a7.437
University of California , Irvine
Assay Description
The assay was performed at 37 °C in HEPES buffer (100 mM, with 10% glycerol, pH 7.4) in the presence of 10 uM L-arginine. Also included were 100 ...
Biochemistry 55: 3702-7 (2016)
Article DOI: 10.1021/acs.biochem.6b00261
BindingDB Entry DOI: 10.7270/Q2WW7GFX
3D
3D Structure (crystal)
Nitric oxide synthase, inducible
(Mus musculus (mouse))
BDBM190668
(US10759791, Compound 14k | nNOS inhibitor, 6)
Show SMILES CN(C)CCCc1cncc(CCc2cc(C)cc(N)n2)c1
Show InChI InChI=1S/C18H26N4/c1-14-9-17(21-18(19)10-14)7-6-16-11-15(12-20-13-16)5-4-8-22(2)3/h9-13H,4-8H2,1-3H3,(H2,19,21)
Reactome pathway
US Patent
1.49E+3n/an/an/an/an/an/an/an/a
Northwestern University
US Patent
Assay Description
Enzyme inhibition was evaluated by measuring NO production with the hemoglobin capture assay, which was performed with purified NOSs in 96-well plate...
US Patent US10759791 (2020)
Nitric Oxide Synthase, inducible
(Mus musculus (mouse))
BDBM190668
(US10759791, Compound 14k | nNOS inhibitor, 6)
Show SMILES CN(C)CCCc1cncc(CCc2cc(C)cc(N)n2)c1
Show InChI InChI=1S/C18H26N4/c1-14-9-17(21-18(19)10-14)7-6-16-11-15(12-20-13-16)5-4-8-22(2)3/h9-13H,4-8H2,1-3H3,(H2,19,21)
Reactome pathway
1.49E+3n/an/an/an/an/an/an/an/a
Northwestern University
Curated by ChEMBL
Assay Description
Inhibition of recombinant mouse macrophage iNOS expressed in Escherichia coli using L-arginine as substrate assessed as reduction in NO production me...
J Med Chem 59: 4913-25 (2016)
BindingDB Entry DOI: 10.7270/Q2J38VHQ
Nitric-oxide synthase, endothelial
(Bos taurus (bovine))
BDBM190668
(US10759791, Compound 14k | nNOS inhibitor, 6)
Show SMILES CN(C)CCCc1cncc(CCc2cc(C)cc(N)n2)c1
Show InChI InChI=1S/C18H26N4/c1-14-9-17(21-18(19)10-14)7-6-16-11-15(12-20-13-16)5-4-8-22(2)3/h9-13H,4-8H2,1-3H3,(H2,19,21)
US Patent
1.66E+4n/an/an/an/an/an/an/an/a
Northwestern University
US Patent
Assay Description
Enzyme inhibition was evaluated by measuring NO production with the hemoglobin capture assay, which was performed with purified NOSs in 96-well plate...
US Patent US10759791 (2020)
3D
3D Structure (crystal)
Nitric Oxide Synthase, endothelial
(Bos taurus (bovine))
BDBM190668
(US10759791, Compound 14k | nNOS inhibitor, 6)
Show SMILES CN(C)CCCc1cncc(CCc2cc(C)cc(N)n2)c1
Show InChI InChI=1S/C18H26N4/c1-14-9-17(21-18(19)10-14)7-6-16-11-15(12-20-13-16)5-4-8-22(2)3/h9-13H,4-8H2,1-3H3,(H2,19,21)
1.66E+4n/an/an/an/an/an/an/an/a
Northwestern University
Curated by ChEMBL
Assay Description
Inhibition of bovine recombinant eNOS expressed in Escherichia coli using L-arginine as substrate assessed as reduction in NO production measured for...
J Med Chem 59: 4913-25 (2016)
BindingDB Entry DOI: 10.7270/Q2J38VHQ
3D
3D Structure (crystal)
Nitric oxide synthase, endothelial
(Homo sapiens (Human))
BDBM190668
(US10759791, Compound 14k | nNOS inhibitor, 6)
Show SMILES CN(C)CCCc1cncc(CCc2cc(C)cc(N)n2)c1
Show InChI InChI=1S/C18H26N4/c1-14-9-17(21-18(19)10-14)7-6-16-11-15(12-20-13-16)5-4-8-22(2)3/h9-13H,4-8H2,1-3H3,(H2,19,21)
3.95E+4n/an/an/an/an/an/an/an/a
Northwestern University
Curated by ChEMBL
Assay Description
Inhibition of human recombinant eNOS expressed in Escherichia coli using L-arginine as substrate assessed as reduction in NO production measured for ...
J Med Chem 59: 4913-25 (2016)
BindingDB Entry DOI: 10.7270/Q2J38VHQ
3D
3D Structure (crystal)
Nitric oxide synthase, endothelial
(Homo sapiens (Human))
BDBM190668
(US10759791, Compound 14k | nNOS inhibitor, 6)
Show SMILES CN(C)CCCc1cncc(CCc2cc(C)cc(N)n2)c1
Show InChI InChI=1S/C18H26N4/c1-14-9-17(21-18(19)10-14)7-6-16-11-15(12-20-13-16)5-4-8-22(2)3/h9-13H,4-8H2,1-3H3,(H2,19,21)
US Patent
3.95E+4n/an/an/an/an/an/an/an/a
Northwestern University
US Patent
Assay Description
Enzyme inhibition was evaluated by measuring NO production with the hemoglobin capture assay, which was performed with purified NOSs in 96-well plate...
US Patent US10759791 (2020)
3D
3D Structure (crystal)