BDBM19133 tert-butyl N-[(1S)-1-(quinolin-3-ylcarbamoyl)-6-sulfanylhexyl]carbamate::thiolate analogue, 15a
SMILES: CC(C)(C)OC(=O)N[C@@H](CCCCCS)C(=O)Nc1cnc2ccccc2c1
InChI Key: InChIKey=ULIPYSGEVHHKMB-SFHVURJKSA-N
Data: 3 IC50
Activity Spreadsheet -- Enzyme Inhibition Constant Data from BindingDB
Found 3 hits for monomerid = 19133
Trg + Lig
Ki
nM
ΔG°
kcal/mole
IC50
nM
Kd
nM
EC50/IC50
nM
koff
s-1
kon
M-1s-1
pHTemp
°C
Histone Deacetylase 6 (HDAC6)
(Mus musculus)
BDBM19133
(tert-butyl N-[(1S)-1-(quinolin-3-ylcarbamoyl)-6-su...)
Show SMILES CC(C)(C)OC(=O)N[C@@H](CCCCCS)C(=O)Nc1cnc2ccccc2c1 |r|
Show InChI InChI=1S/C21H29N3O3S/c1-21(2,3)27-20(26)24-18(11-5-4-8-12-28)19(25)23-16-13-15-9-6-7-10-17(15)22-14-16/h6-7,9-10,13-14,18,28H,4-5,8,11-12H2,1-3H3,(H,23,25)(H,24,26)/t18-/m0/s1
Reactome pathway
n/an/a 32n/an/an/an/a8.037
Nagoya City University
Assay Description
The enzyme activity was assayed using recombinant HDAC and [3H] acetyl-labeled histones as substrate. The released [3H]acetic acid was extracted and ...
J Med Chem 50: 5425-38 (2007)
Article DOI: 10.1021/jm7009217
BindingDB Entry DOI: 10.7270/Q2XK8CT6
Histone deacetylase 4
(Homo sapiens (Human))
BDBM19133
(tert-butyl N-[(1S)-1-(quinolin-3-ylcarbamoyl)-6-su...)
Show SMILES CC(C)(C)OC(=O)N[C@@H](CCCCCS)C(=O)Nc1cnc2ccccc2c1 |r|
Show InChI InChI=1S/C21H29N3O3S/c1-21(2,3)27-20(26)24-18(11-5-4-8-12-28)19(25)23-16-13-15-9-6-7-10-17(15)22-14-16/h6-7,9-10,13-14,18,28H,4-5,8,11-12H2,1-3H3,(H,23,25)(H,24,26)/t18-/m0/s1
n/an/a 33n/an/an/an/an/an/a
Nagoya City University
Assay Description
The enzyme activity was assayed using recombinant HDAC and [3H] acetyl-labeled histones as substrate. The released [3H]acetic acid was extracted and ...
J Med Chem 50: 5425-38 (2007)
Article DOI: 10.1021/jm7009217
BindingDB Entry DOI: 10.7270/Q2XK8CT6
Histone deacetylase 1
(Homo sapiens (Human))
BDBM19133
(tert-butyl N-[(1S)-1-(quinolin-3-ylcarbamoyl)-6-su...)
Show SMILES CC(C)(C)OC(=O)N[C@@H](CCCCCS)C(=O)Nc1cnc2ccccc2c1 |r|
Show InChI InChI=1S/C21H29N3O3S/c1-21(2,3)27-20(26)24-18(11-5-4-8-12-28)19(25)23-16-13-15-9-6-7-10-17(15)22-14-16/h6-7,9-10,13-14,18,28H,4-5,8,11-12H2,1-3H3,(H,23,25)(H,24,26)/t18-/m0/s1
NCI pathway
Reactome pathway
n/an/a 51n/an/an/an/a8.037
Nagoya City University
Assay Description
The enzyme activity was assayed using recombinant HDAC and [3H] acetyl-labeled histones as substrate. The released [3H]acetic acid was extracted and ...
J Med Chem 50: 5425-38 (2007)
Article DOI: 10.1021/jm7009217
BindingDB Entry DOI: 10.7270/Q2XK8CT6