null
SMILES: CC(C)(NC(=O)c1cc2[nH]c3ccccc3c(=O)c2cc1F)c1cccc(c1)S(C)(=O)=O
InChI Key: InChIKey=HPGUXRZIRNCJBJ-UHFFFAOYSA-N
Activity Spreadsheet -- Enzyme Inhibition Constant Data from BindingDB
Found 1 hit for monomerid = 19282
Trg + Lig
Ki
nM
ΔG°
kcal/mole
IC50
nM
Kd
nM
EC50/IC50
nM
koff
s-1
kon
M-1s-1
pHTemp
°C
Inosine-5'-monophosphate dehydrogenase 2
(Homo sapiens (Human))
BDBM19282
(2-fluoro-N-[2-(3-methanesulfonylphenyl)propan-2-yl...)
Show SMILES CC(C)(NC(=O)c1cc2[nH]c3ccccc3c(=O)c2cc1F)c1cccc(c1)S(C)(=O)=O
Show InChI InChI=1S/C24H21FN2O4S/c1-24(2,14-7-6-8-15(11-14)32(3,30)31)27-23(29)17-13-21-18(12-19(17)25)22(28)16-9-4-5-10-20(16)26-21/h4-13H,1-3H3,(H,26,28)(H,27,29)
Reactome pathway
n/an/a 12n/a 580n/an/a8.025
Bristol-Myers Squibb Company
Assay Description
Inhibition assays were performed using recombinant human IMPDH type 2 and varying concentrations of inhibitor. The production of NADH was monitored b...
J Med Chem 50: 3730-42 (2007)
Article DOI: 10.1021/jm070299x
BindingDB Entry DOI: 10.7270/Q2N58JPV