BDBM194084 US9199981, F19
SMILES: CO[C@H]1C[C@H](C1)c1nc(no1)-c1ccc(C)c(NC(=O)c2cnc3ccccn23)c1
InChI Key: InChIKey=MKRHTMICEQFIHC-IYBDPMFKSA-N
Data: 1 IC50
Activity Spreadsheet -- Enzyme Inhibition Constant Data from BindingDB
Found 1 hit for monomerid = 194084
Trg + Lig
Ki
nM
ΔG°
kcal/mole
IC50
nM
Kd
nM
EC50/IC50
nM
koff
s-1
kon
M-1s-1
pHTemp
°C
Mast/stem cell growth factor receptor Kit
(Homo sapiens (Human))
BDBM194084
(US9199981, F19)
Show SMILES CO[C@H]1C[C@H](C1)c1nc(no1)-c1ccc(C)c(NC(=O)c2cnc3ccccn23)c1 |r,wD:4.6,2.1,(7.85,-.09,;6.52,-.86,;5.18,-.09,;4.78,1.4,;3.3,1,;3.69,-.49,;1.96,1.77,;.5,1.29,;-.41,2.54,;.5,3.78,;1.96,3.31,;-1.95,2.54,;-2.72,3.87,;-4.26,3.87,;-5.03,2.54,;-6.57,2.54,;-4.26,1.2,;-5.03,-.13,;-6.57,-.13,;-7.34,1.2,;-7.34,-1.46,;-6.79,-2.9,;-7.98,-3.87,;-9.27,-3.03,;-10.76,-3.43,;-11.85,-2.34,;-11.45,-.85,;-9.96,-.46,;-8.88,-1.54,;-2.72,1.2,)|
Show InChI InChI=1S/C22H21N5O3/c1-13-6-7-14(20-25-22(30-26-20)15-9-16(10-15)29-2)11-17(13)24-21(28)18-12-23-19-5-3-4-8-27(18)19/h3-8,11-12,15-16H,9-10H2,1-2H3,(H,24,28)/t15-,16+
US Patent
n/an/a 9n/an/an/an/an/an/a
NOVARTIS AG
US Patent
Assay Description
The compounds was tested for inhibition of SCF dependent proliferation using human Mo7e cells which endogenously express c-kit in a 384 well format. ...
US Patent US9199981 (2015)
BindingDB Entry DOI: 10.7270/Q2M32TKJ