BDBM19412 CHEMBL235674::benzamide-type inhibitor, 4::pyridin-3-ylmethyl N-[(4-{[2-amino-5-(thiophen-2-yl)phenyl]carbamoyl}phenyl)methyl]carbamate
SMILES: Nc1ccc(cc1NC(=O)c1ccc(CNC(=O)OCc2cccnc2)cc1)-c1cccs1
InChI Key: InChIKey=ASIJNKHQTPQFCQ-UHFFFAOYSA-N
Data: 8 IC50
Activity Spreadsheet -- Enzyme Inhibition Constant Data from BindingDB
Found 8 hits for monomerid = 19412
Trg + Lig
Ki
nM
ΔG°
kcal/mole
IC50
nM
Kd
nM
EC50/IC50
nM
koff
s-1
kon
M-1s-1
pHTemp
°C
Histone deacetylase 1
(Homo sapiens (Human))
BDBM19412
(CHEMBL235674 | benzamide-type inhibitor, 4 | pyrid...)
Show SMILES Nc1ccc(cc1NC(=O)c1ccc(CNC(=O)OCc2cccnc2)cc1)-c1cccs1
Show InChI InChI=1S/C25H22N4O3S/c26-21-10-9-20(23-4-2-12-33-23)13-22(21)29-24(30)19-7-5-17(6-8-19)15-28-25(31)32-16-18-3-1-11-27-14-18/h1-14H,15-16,26H2,(H,28,31)(H,29,30)
NCI pathway
Reactome pathway
n/an/a 20n/an/an/an/a8.037
MethylGene Inc
Assay Description
For the enzyme assay, the enzyme fraction was added to fluorescent substrate in the presence of test compounds, and the mixture was incubated for add...
J Med Chem 50: 5543-6 (2007)
Article DOI: 10.1021/jm701079h
BindingDB Entry DOI: 10.7270/Q2445JS2
Histone deacetylase 2
(Homo sapiens (Human))
BDBM19412
(CHEMBL235674 | benzamide-type inhibitor, 4 | pyrid...)
Show SMILES Nc1ccc(cc1NC(=O)c1ccc(CNC(=O)OCc2cccnc2)cc1)-c1cccs1
Show InChI InChI=1S/C25H22N4O3S/c26-21-10-9-20(23-4-2-12-33-23)13-22(21)29-24(30)19-7-5-17(6-8-19)15-28-25(31)32-16-18-3-1-11-27-14-18/h1-14H,15-16,26H2,(H,28,31)(H,29,30)
NCI pathway
Reactome pathway
n/an/a 100n/an/an/an/a8.037
MethylGene Inc
Assay Description
For the enzyme assay, the enzyme fraction was added to fluorescent substrate in the presence of test compounds, and the mixture was incubated for add...
J Med Chem 50: 5543-6 (2007)
Article DOI: 10.1021/jm701079h
BindingDB Entry DOI: 10.7270/Q2445JS2
Histone deacetylase 1
(Homo sapiens (Human))
BDBM19412
(CHEMBL235674 | benzamide-type inhibitor, 4 | pyrid...)
Show SMILES Nc1ccc(cc1NC(=O)c1ccc(CNC(=O)OCc2cccnc2)cc1)-c1cccs1
Show InChI InChI=1S/C25H22N4O3S/c26-21-10-9-20(23-4-2-12-33-23)13-22(21)29-24(30)19-7-5-17(6-8-19)15-28-25(31)32-16-18-3-1-11-27-14-18/h1-14H,15-16,26H2,(H,28,31)(H,29,30)
NCI pathway
Reactome pathway
n/an/a 190n/an/an/an/an/an/a
Merck Research Laboratories
Curated by ChEMBL
Assay Description
Inhibition of HDAC1
Bioorg Med Chem Lett 18: 726-31 (2008)
Article DOI: 10.1016/j.bmcl.2007.11.047
BindingDB Entry DOI: 10.7270/Q28W3D1M
Histone deacetylase 3
(Homo sapiens (Human))
BDBM19412
(CHEMBL235674 | benzamide-type inhibitor, 4 | pyrid...)
Show SMILES Nc1ccc(cc1NC(=O)c1ccc(CNC(=O)OCc2cccnc2)cc1)-c1cccs1
Show InChI InChI=1S/C25H22N4O3S/c26-21-10-9-20(23-4-2-12-33-23)13-22(21)29-24(30)19-7-5-17(6-8-19)15-28-25(31)32-16-18-3-1-11-27-14-18/h1-14H,15-16,26H2,(H,28,31)(H,29,30)
NCI pathway
Reactome pathway
n/an/a 2.77E+4n/an/an/an/an/an/a
Merck Research Laboratories
Curated by ChEMBL
Assay Description
Inhibition of HDAC3
Bioorg Med Chem Lett 18: 726-31 (2008)
Article DOI: 10.1016/j.bmcl.2007.11.047
BindingDB Entry DOI: 10.7270/Q28W3D1M
Histone deacetylase 8
(Homo sapiens (Human))
BDBM19412
(CHEMBL235674 | benzamide-type inhibitor, 4 | pyrid...)
Show SMILES Nc1ccc(cc1NC(=O)c1ccc(CNC(=O)OCc2cccnc2)cc1)-c1cccs1
Show InChI InChI=1S/C25H22N4O3S/c26-21-10-9-20(23-4-2-12-33-23)13-22(21)29-24(30)19-7-5-17(6-8-19)15-28-25(31)32-16-18-3-1-11-27-14-18/h1-14H,15-16,26H2,(H,28,31)(H,29,30)
NCI pathway
Reactome pathway
n/an/a 3.17E+4n/an/an/an/an/an/a
Merck Research Laboratories
Curated by ChEMBL
Assay Description
Inhibition of HDAC8
Bioorg Med Chem Lett 18: 726-31 (2008)
Article DOI: 10.1016/j.bmcl.2007.11.047
BindingDB Entry DOI: 10.7270/Q28W3D1M
Cereblon/Histone deacetylase 6
(Homo sapiens (Human))
BDBM19412
(CHEMBL235674 | benzamide-type inhibitor, 4 | pyrid...)
Show SMILES Nc1ccc(cc1NC(=O)c1ccc(CNC(=O)OCc2cccnc2)cc1)-c1cccs1
Show InChI InChI=1S/C25H22N4O3S/c26-21-10-9-20(23-4-2-12-33-23)13-22(21)29-24(30)19-7-5-17(6-8-19)15-28-25(31)32-16-18-3-1-11-27-14-18/h1-14H,15-16,26H2,(H,28,31)(H,29,30)
NCI pathway
Reactome pathway
n/an/a>5.00E+4n/an/an/an/an/an/a
Merck Research Laboratories
Curated by ChEMBL
Assay Description
Inhibition of HDAC6
Bioorg Med Chem Lett 18: 726-31 (2008)
Article DOI: 10.1016/j.bmcl.2007.11.047
BindingDB Entry DOI: 10.7270/Q28W3D1M
Histone deacetylase 4
(Homo sapiens (Human))
BDBM19412
(CHEMBL235674 | benzamide-type inhibitor, 4 | pyrid...)
Show SMILES Nc1ccc(cc1NC(=O)c1ccc(CNC(=O)OCc2cccnc2)cc1)-c1cccs1
Show InChI InChI=1S/C25H22N4O3S/c26-21-10-9-20(23-4-2-12-33-23)13-22(21)29-24(30)19-7-5-17(6-8-19)15-28-25(31)32-16-18-3-1-11-27-14-18/h1-14H,15-16,26H2,(H,28,31)(H,29,30)
n/an/a>5.00E+4n/an/an/an/an/an/a
Merck Research Laboratories
Curated by ChEMBL
Assay Description
Inhibition of HDAC4
Bioorg Med Chem Lett 18: 726-31 (2008)
Article DOI: 10.1016/j.bmcl.2007.11.047
BindingDB Entry DOI: 10.7270/Q28W3D1M
Histone deacetylase 2
(Homo sapiens (Human))
BDBM19412
(CHEMBL235674 | benzamide-type inhibitor, 4 | pyrid...)
Show SMILES Nc1ccc(cc1NC(=O)c1ccc(CNC(=O)OCc2cccnc2)cc1)-c1cccs1
Show InChI InChI=1S/C25H22N4O3S/c26-21-10-9-20(23-4-2-12-33-23)13-22(21)29-24(30)19-7-5-17(6-8-19)15-28-25(31)32-16-18-3-1-11-27-14-18/h1-14H,15-16,26H2,(H,28,31)(H,29,30)
NCI pathway
Reactome pathway
n/an/a 6n/an/an/an/an/an/a
Merck Research Laboratories
Curated by ChEMBL
Assay Description
Inhibition of HDAC2
Bioorg Med Chem Lett 18: 726-31 (2008)
Article DOI: 10.1016/j.bmcl.2007.11.047
BindingDB Entry DOI: 10.7270/Q28W3D1M