null
SMILES: Oc1ccc(cc1)-c1c(nn2c(cc(nc12)C(F)(F)F)C(F)(F)F)-c1ccc(OCCN2CCCCC2)cc1
InChI Key: InChIKey=YGODQTYHFUSOPS-UHFFFAOYSA-N
Activity Spreadsheet -- Enzyme Inhibition Constant Data from BindingDB
Found 2 hits for monomerid = 19457
Trg + Lig
Ki
nM
ΔG°
kcal/mole
IC50
nM
Kd
nM
EC50/IC50
nM
koff
s-1
kon
M-1s-1
pHTemp
°C
Estrogen receptor beta
(Homo sapiens (Human))
BDBM19457
(4-(2-{4-[2-(piperidin-1-yl)ethoxy]phenyl}-5,7-bis(...)
Show SMILES Oc1ccc(cc1)-c1c(nn2c(cc(nc12)C(F)(F)F)C(F)(F)F)-c1ccc(OCCN2CCCCC2)cc1
Show InChI InChI=1S/C27H24F6N4O2/c28-26(29,30)21-16-22(27(31,32)33)37-25(34-21)23(17-4-8-19(38)9-5-17)24(35-37)18-6-10-20(11-7-18)39-15-14-36-12-2-1-3-13-36/h4-11,16,38H,1-3,12-15H2
192 -8.39n/an/an/an/an/a7.50
University of Illinois at Urbana
Assay Description
Relative binding affinities were determined by a competitive radiometric binding assay using [3H]estradiol as tracer, and purified full-length human ...
J Med Chem 50: 399-403 (2007)
Article DOI: 10.1021/jm061035y
BindingDB Entry DOI: 10.7270/Q2QZ288F
Estrogen receptor
(Homo sapiens (Human))
BDBM19457
(4-(2-{4-[2-(piperidin-1-yl)ethoxy]phenyl}-5,7-bis(...)
Show SMILES Oc1ccc(cc1)-c1c(nn2c(cc(nc12)C(F)(F)F)C(F)(F)F)-c1ccc(OCCN2CCCCC2)cc1
Show InChI InChI=1S/C27H24F6N4O2/c28-26(29,30)21-16-22(27(31,32)33)37-25(34-21)23(17-4-8-19(38)9-5-17)24(35-37)18-6-10-20(11-7-18)39-15-14-36-12-2-1-3-13-36/h4-11,16,38H,1-3,12-15H2
266 -8.21n/an/an/an/an/a7.50
University of Illinois at Urbana
Assay Description
Relative binding affinities were determined by a competitive radiometric binding assay using [3H]estradiol as tracer, and purified full-length human ...
J Med Chem 50: 399-403 (2007)
Article DOI: 10.1021/jm061035y
BindingDB Entry DOI: 10.7270/Q2QZ288F