BDBM196138 US9211296, Table 7, Compd: 9
SMILES: CC1=CC(C)(C)N=C(Nc2nc(C)c3cc(C)cc(C)c3n2)N1
InChI Key: InChIKey=NXZXRPKKYIPBNO-UHFFFAOYSA-N
Data: 3 IC50
Activity Spreadsheet -- Enzyme Inhibition Constant Data from BindingDB
Found 3 hits for monomerid = 196138
Trg + Lig
Ki
nM
ΔG°
kcal/mole
IC50
nM
Kd
nM
EC50/IC50
nM
koff
s-1
kon
M-1s-1
pHTemp
°C
DNA Synthesis
(Vaccinia virus (strain WR))
BDBM196138
(US9211296, Table 7, Compd: 9)
Show SMILES CC1=CC(C)(C)N=C(Nc2nc(C)c3cc(C)cc(C)c3n2)N1 |t:1,6|
Show InChI InChI=1S/C18H23N5/c1-10-7-11(2)15-14(8-10)13(4)20-16(21-15)22-17-19-12(3)9-18(5,6)23-17/h7-9H,1-6H3,(H2,19,20,21,22,23)
US Patent
n/an/a 5.30E+3n/an/an/an/a7.437
The Trustees of the University of Pennsylvania
US Patent
Assay Description
A rapid plate DNA synthesis assay was performed using optimized conditions. Briefly, a 1.2:1 ratio of a 20-mer oligonucleotide primer (5′-GCGAA...
US Patent US9211296 (2015)
BindingDB Entry DOI: 10.7270/Q2G73CHS
Signal transducer and activator of transcription 3
(Homo sapiens (Human))
BDBM196138
(US9211296, Table 7, Compd: 9)
Show SMILES CC1=CC(C)(C)N=C(Nc2nc(C)c3cc(C)cc(C)c3n2)N1 |t:1,6|
Show InChI InChI=1S/C18H23N5/c1-10-7-11(2)15-14(8-10)13(4)20-16(21-15)22-17-19-12(3)9-18(5,6)23-17/h7-9H,1-6H3,(H2,19,20,21,22,23)
n/an/a 800n/an/an/an/an/an/a
University of Pittsburgh Chemical Diversity Center
Curated by ChEMBL
Assay Description
Inhibition of IL-6-induced STAT3 phosphorylation in human Cal33 cells assessed as nuclear translocation by Western blot analysis
Bioorg Med Chem Lett 24: 5081-5 (2014)
BindingDB Entry DOI: 10.7270/Q2X63PPF
Signal transducer and activator of transcription 1-alpha/beta
(Homo sapiens (Human))
BDBM196138
(US9211296, Table 7, Compd: 9)
Show SMILES CC1=CC(C)(C)N=C(Nc2nc(C)c3cc(C)cc(C)c3n2)N1 |t:1,6|
Show InChI InChI=1S/C18H23N5/c1-10-7-11(2)15-14(8-10)13(4)20-16(21-15)22-17-19-12(3)9-18(5,6)23-17/h7-9H,1-6H3,(H2,19,20,21,22,23)
NCI pathway
Reactome pathway
n/an/a 5.90E+3n/an/an/an/an/an/a
University of Pittsburgh Chemical Diversity Center
Curated by ChEMBL
Assay Description
Inhibition of IFNgamma-induced STAT1 phosphorylation in human Cal33 cells by Western blot analysis
Bioorg Med Chem Lett 24: 5081-5 (2014)
BindingDB Entry DOI: 10.7270/Q2X63PPF