null
SMILES: CO[C@]12CC[C@@]3(C[C@@H]1COCc1ccccc1)[C@H]1Cc4ccc(NC(C)=O)c5O[C@@H]2[C@]3(CCN1C)c45
InChI Key: InChIKey=WVIVIJLVLLLXNW-CLRRHZRJSA-N
Activity Spreadsheet -- Enzyme Inhibition Constant Data from BindingDB
Found 7 hits for monomerid = 199352
Trg + Lig
Ki
nM
ΔG°
kcal/mole
IC50
nM
Kd
nM
EC50/IC50
nM
koff
s-1
kon
M-1s-1
pHTemp
°C
Kappa-type opioid receptor
(Homo sapiens (Human))
BDBM199352
(US9221831, 17)
Show SMILES CO[C@]12CC[C@@]3(C[C@@H]1COCc1ccccc1)[C@H]1Cc4ccc(NC(C)=O)c5O[C@@H]2[C@]3(CCN1C)c45 |r,TLB:8:7:30.29:4.3|
Show InChI InChI=1S/C30H36N2O4/c1-19(33)31-23-10-9-21-15-24-28-11-12-30(34-3,22(16-28)18-35-17-20-7-5-4-6-8-20)27-29(28,13-14-32(24)2)25(21)26(23)36-27/h4-10,22,24,27H,11-18H2,1-3H3,(H,31,33)/t22-,24-,27-,28-,29+,30-/m1/s1
Reactome pathway
US Patent
15.2n/an/an/an/an/an/a7.4n/a
Purdue Pharma, L.P.
US Patent
Assay Description
Radioligand dose displacement assays used 0.4 nM [3H]-U69,593 (GE Healthcare, Piscataway, N.J.; 40 Ci/mmole) with 15 μg membrane protein (recomb...
US Patent US9221831 (2015)
BindingDB Entry DOI: 10.7270/Q2T72G8M
Mu-type opioid receptor
(Homo sapiens (Human))
BDBM199352
(US9221831, 17)
Show SMILES CO[C@]12CC[C@@]3(C[C@@H]1COCc1ccccc1)[C@H]1Cc4ccc(NC(C)=O)c5O[C@@H]2[C@]3(CCN1C)c45 |r,TLB:8:7:30.29:4.3|
Show InChI InChI=1S/C30H36N2O4/c1-19(33)31-23-10-9-21-15-24-28-11-12-30(34-3,22(16-28)18-35-17-20-7-5-4-6-8-20)27-29(28,13-14-32(24)2)25(21)26(23)36-27/h4-10,22,24,27H,11-18H2,1-3H3,(H,31,33)/t22-,24-,27-,28-,29+,30-/m1/s1
NCI pathway
Reactome pathway
US Patent
133 -10.2n/an/an/an/an/a7.450
Purdue Pharma, L.P.
US Patent
Assay Description
Radioligand dose-displacement binding assays for t-opioid receptors used 0.3 nM [3H]-diprenorphine (Perkin Elmer, Shelton, Conn.), with 5 mg membrane...
US Patent US9221831 (2015)
BindingDB Entry DOI: 10.7270/Q2T72G8M
Opioid growth factor receptor-like protein 1
(Homo sapiens (Human))
BDBM199352
(US9221831, 17)
Show SMILES CO[C@]12CC[C@@]3(C[C@@H]1COCc1ccccc1)[C@H]1Cc4ccc(NC(C)=O)c5O[C@@H]2[C@]3(CCN1C)c45 |r,TLB:8:7:30.29:4.3|
Show InChI InChI=1S/C30H36N2O4/c1-19(33)31-23-10-9-21-15-24-28-11-12-30(34-3,22(16-28)18-35-17-20-7-5-4-6-8-20)27-29(28,13-14-32(24)2)25(21)26(23)36-27/h4-10,22,24,27H,11-18H2,1-3H3,(H,31,33)/t22-,24-,27-,28-,29+,30-/m1/s1
US Patent
188 -9.94n/an/an/an/an/a7.450
Purdue Pharma, L.P.
US Patent
Assay Description
Radioligand binding assays (screening and dose-displacement) used 0.1 nM [3H]-nociceptin (Perkin Elmer, Shelton, Conn.; 87.7 Ci/mmole) with 12 ug mem...
US Patent US9221831 (2015)
BindingDB Entry DOI: 10.7270/Q2T72G8M
Delta-type opioid receptor
(Homo sapiens (Human))
BDBM199352
(US9221831, 17)
Show SMILES CO[C@]12CC[C@@]3(C[C@@H]1COCc1ccccc1)[C@H]1Cc4ccc(NC(C)=O)c5O[C@@H]2[C@]3(CCN1C)c45 |r,TLB:8:7:30.29:4.3|
Show InChI InChI=1S/C30H36N2O4/c1-19(33)31-23-10-9-21-15-24-28-11-12-30(34-3,22(16-28)18-35-17-20-7-5-4-6-8-20)27-29(28,13-14-32(24)2)25(21)26(23)36-27/h4-10,22,24,27H,11-18H2,1-3H3,(H,31,33)/t22-,24-,27-,28-,29+,30-/m1/s1
Reactome pathway
US Patent
4.10E+3 -7.34n/an/an/an/an/a7.425
Purdue Pharma, L.P.
US Patent
Assay Description
Delta-opioid Receptor Binding Assay Procedures were conducted as follows. Radioligand dose-displacement assays used 0.3 nM [3H]-Naltrindole (Perkin...
US Patent US9221831 (2015)
BindingDB Entry DOI: 10.7270/Q2T72G8M
Opioid growth factor receptor-like protein 1
(Homo sapiens (Human))
BDBM199352
(US9221831, 17)
Show SMILES CO[C@]12CC[C@@]3(C[C@@H]1COCc1ccccc1)[C@H]1Cc4ccc(NC(C)=O)c5O[C@@H]2[C@]3(CCN1C)c45 |r,TLB:8:7:30.29:4.3|
Show InChI InChI=1S/C30H36N2O4/c1-19(33)31-23-10-9-21-15-24-28-11-12-30(34-3,22(16-28)18-35-17-20-7-5-4-6-8-20)27-29(28,13-14-32(24)2)25(21)26(23)36-27/h4-10,22,24,27H,11-18H2,1-3H3,(H,31,33)/t22-,24-,27-,28-,29+,30-/m1/s1
US Patent
n/an/an/an/a 3.52E+3n/an/a7.450
Purdue Pharma, L.P.
US Patent
Assay Description
Functional [35S]GTPgammaS binding assays were conducted as follows. ORL-1 membrane solution was prepared by sequentially adding final concentrations ...
US Patent US9221831 (2015)
BindingDB Entry DOI: 10.7270/Q2T72G8M
Mu-type opioid receptor
(Homo sapiens (Human))
BDBM199352
(US9221831, 17)
Show SMILES CO[C@]12CC[C@@]3(C[C@@H]1COCc1ccccc1)[C@H]1Cc4ccc(NC(C)=O)c5O[C@@H]2[C@]3(CCN1C)c45 |r,TLB:8:7:30.29:4.3|
Show InChI InChI=1S/C30H36N2O4/c1-19(33)31-23-10-9-21-15-24-28-11-12-30(34-3,22(16-28)18-35-17-20-7-5-4-6-8-20)27-29(28,13-14-32(24)2)25(21)26(23)36-27/h4-10,22,24,27H,11-18H2,1-3H3,(H,31,33)/t22-,24-,27-,28-,29+,30-/m1/s1
NCI pathway
Reactome pathway
US Patent
n/an/an/an/a 694n/an/a7.425
Purdue Pharma, L.P.
US Patent
Assay Description
[35S]GTPgammaS functional assays were conducted using freshly thawed u-receptor membranes (Perkin Elmer, Shelton, Conn.). Assay reactions were prepa...
US Patent US9221831 (2015)
BindingDB Entry DOI: 10.7270/Q2T72G8M
Kappa-type opioid receptor
(Homo sapiens (Human))
BDBM199352
(US9221831, 17)
Show SMILES CO[C@]12CC[C@@]3(C[C@@H]1COCc1ccccc1)[C@H]1Cc4ccc(NC(C)=O)c5O[C@@H]2[C@]3(CCN1C)c45 |r,TLB:8:7:30.29:4.3|
Show InChI InChI=1S/C30H36N2O4/c1-19(33)31-23-10-9-21-15-24-28-11-12-30(34-3,22(16-28)18-35-17-20-7-5-4-6-8-20)27-29(28,13-14-32(24)2)25(21)26(23)36-27/h4-10,22,24,27H,11-18H2,1-3H3,(H,31,33)/t22-,24-,27-,28-,29+,30-/m1/s1
Reactome pathway
US Patent
n/an/an/an/a 951n/an/a7.425
Purdue Pharma, L.P.
US Patent
Assay Description
Functional [35S]GTPgammaS binding assays were conducted as follows. κ opioid receptor membrane solution was prepared by sequentially adding final ...
US Patent US9221831 (2015)
BindingDB Entry DOI: 10.7270/Q2T72G8M