BDBM20105 dipeptide-derived nitrile, 26::tert-butyl N-[(1S)-1-[(cyanomethyl)carbamoyl]-2-(2-fluorophenyl)ethyl]carbamate
SMILES: CC(C)(C)OC(=O)N[C@@H](Cc1ccccc1F)C(=O)NCC#N
InChI Key: InChIKey=WNGKZFARHLWXIK-ZDUSSCGKSA-N
Data: 4 KI
Activity Spreadsheet -- Enzyme Inhibition Constant Data from BindingDB
Found 4 hits for monomerid = 20105
Trg + Lig
Ki
nM
ΔG°
kcal/mole
IC50
nM
Kd
nM
EC50/IC50
nM
koff
s-1
kon
M-1s-1
pHTemp
°C
Papain
(Carica papaya)
BDBM20105
(dipeptide-derived nitrile, 26 | tert-butyl N-[(1S)...)
Show SMILES CC(C)(C)OC(=O)N[C@@H](Cc1ccccc1F)C(=O)NCC#N |r|
Show InChI InChI=1S/C16H20FN3O3/c1-16(2,3)23-15(22)20-13(14(21)19-9-8-18)10-11-6-4-5-7-12(11)17/h4-7,13H,9-10H2,1-3H3,(H,19,21)(H,20,22)/t13-/m0/s1
400 -8.72n/an/an/an/an/a6.525
Rheinische Friedrich-Wilhelms-Universitat Bonn
Assay Description
Enzyme activities were calculated from kinetic measurements performed by spectrophotometric detection of the product p-nitroaniline (pNA) at waveleng...
J Med Chem 48: 7688-707 (2005)
Article DOI: 10.1021/jm050686b
BindingDB Entry DOI: 10.7270/Q2GB22BG
Cathepsin L
(Bos taurus (bovine))
BDBM20105
(dipeptide-derived nitrile, 26 | tert-butyl N-[(1S)...)
Show SMILES CC(C)(C)OC(=O)N[C@@H](Cc1ccccc1F)C(=O)NCC#N |r|
Show InChI InChI=1S/C16H20FN3O3/c1-16(2,3)23-15(22)20-13(14(21)19-9-8-18)10-11-6-4-5-7-12(11)17/h4-7,13H,9-10H2,1-3H3,(H,19,21)(H,20,22)/t13-/m0/s1
Reactome pathway
470n/an/an/an/an/an/an/an/a
Rheinische Friedrich-Wilhelms-Universitat Bonn
Assay Description
Enzyme activities were calculated from kinetic measurements performed by fluorimetric detection of the product AMC at the wavelengths for excitation ...
J Med Chem 48: 7688-707 (2005)
Article DOI: 10.1021/jm050686b
BindingDB Entry DOI: 10.7270/Q2GB22BG
Cathepsin S
(Homo sapiens (Human))
BDBM20105
(dipeptide-derived nitrile, 26 | tert-butyl N-[(1S)...)
Show SMILES CC(C)(C)OC(=O)N[C@@H](Cc1ccccc1F)C(=O)NCC#N |r|
Show InChI InChI=1S/C16H20FN3O3/c1-16(2,3)23-15(22)20-13(14(21)19-9-8-18)10-11-6-4-5-7-12(11)17/h4-7,13H,9-10H2,1-3H3,(H,19,21)(H,20,22)/t13-/m0/s1
Reactome pathway
770n/an/an/an/an/an/an/an/a
Rheinische Friedrich-Wilhelms-Universitat Bonn
Assay Description
Enzyme activities were calculated from kinetic measurements performed by fluorimetric detection of the product AMC at the wavelengths for excitation ...
J Med Chem 48: 7688-707 (2005)
Article DOI: 10.1021/jm050686b
BindingDB Entry DOI: 10.7270/Q2GB22BG
Cathepsin K
(Homo sapiens (Human))
BDBM20105
(dipeptide-derived nitrile, 26 | tert-butyl N-[(1S)...)
Show SMILES CC(C)(C)OC(=O)N[C@@H](Cc1ccccc1F)C(=O)NCC#N |r|
Show InChI InChI=1S/C16H20FN3O3/c1-16(2,3)23-15(22)20-13(14(21)19-9-8-18)10-11-6-4-5-7-12(11)17/h4-7,13H,9-10H2,1-3H3,(H,19,21)(H,20,22)/t13-/m0/s1
Reactome pathway
3.30E+3n/an/an/an/an/an/an/an/a
Rheinische Friedrich-Wilhelms-Universitat Bonn
Assay Description
Enzyme activities were calculated from kinetic measurements performed by fluorimetric detection of the product AMC at the wavelengths for excitation ...
J Med Chem 48: 7688-707 (2005)
Article DOI: 10.1021/jm050686b
BindingDB Entry DOI: 10.7270/Q2GB22BG