BDBM201507 US9187424, 274
SMILES: FC(F)Oc1ccc(cc1)C1=C(c2nn[nH]n2)C(=O)NC(C1)(c1ccc(OCCCCCC(F)(F)F)cc1F)C(F)(F)F
InChI Key:
Data: 1 IC50
Activity Spreadsheet -- Enzyme Inhibition Constant Data from BindingDB
Found 1 hit for monomerid = 201507
Trg + Lig
Ki
nM
ΔG°
kcal/mole
IC50
nM
Kd
nM
EC50/IC50
nM
koff
s-1
kon
M-1s-1
pHTemp
°C
Alpha-1,6-mannosyl-glycoprotein 2-beta-N-acetylglucosaminyltransferase
(Homo sapiens (Human))
BDBM201507
(US9187424, 274)
Show SMILES FC(F)Oc1ccc(cc1)C1=C(c2nn[nH]n2)C(=O)NC(C1)(c1ccc(OCCCCCC(F)(F)F)cc1F)C(F)(F)F |c:11|
US Patent
n/an/a 1n/an/an/an/a7.4n/a
Bristol-Myers Squibb Company
US Patent
Assay Description
The MGAT enzyme reactions were performed in CORNING Falcon 96-well Polypropylene plates, in a total volume of 60 uL of 50 mM Potassium Phosphate buff...
US Patent US9187424 (2015)
BindingDB Entry DOI: 10.7270/Q2FQ9VFG