null
SMILES: CCN(CCNC(=O)Nc1cccc2ccccc12)c1cccc(C)c1
InChI Key: InChIKey=WNWYPZITBPAWSB-UHFFFAOYSA-N
Activity Spreadsheet -- Enzyme Inhibition Constant Data from BindingDB
Found 1 hit for monomerid = 20475
Trg + Lig
Ki
nM
ΔG°
kcal/mole
IC50
nM
Kd
nM
EC50/IC50
nM
koff
s-1
kon
M-1s-1
pHTemp
°C
Transient receptor potential cation channel subfamily V member 1
(Homo sapiens (Human))
BDBM20475
(3-{2-[ethyl(3-methylphenyl)amino]ethyl}-1-naphthal...)
Show SMILES CCN(CCNC(=O)Nc1cccc2ccccc12)c1cccc(C)c1
Show InChI InChI=1S/C22H25N3O/c1-3-25(19-11-6-8-17(2)16-19)15-14-23-22(26)24-21-13-7-10-18-9-4-5-12-20(18)21/h4-13,16H,3,14-15H2,1-2H3,(H2,23,24,26)
Reactome pathway
n/an/an/an/a 79n/an/a7.225
GSK
Assay Description
One day before the assay was performed, human TRPV1 expressed in 1321N1 astrocytoma cells were plated onto 96-well assay plates and grown until 2.5 h...
Bioorg Med Chem Lett 14: 3631-4 (2004)
Article DOI: 10.1016/j.bmcl.2004.05.028
BindingDB Entry DOI: 10.7270/Q24T6GM8