BDBM20681 2-amino-5-[(4-bromophenyl)methyl]-6-methyl-3H,4H,5H-pyrrolo[3,2-d]pyrimidin-4-one::Pyrrolo[3,2-d]pyrimidine analogue, 9
SMILES: Cc1cc2nc(N)[nH]c(=O)c2n1Cc1ccc(Br)cc1
InChI Key: InChIKey=FPMKGRSJBZZZBG-UHFFFAOYSA-N
Data: 6 IC50
Activity Spreadsheet -- Enzyme Inhibition Constant Data from BindingDB
Found 6 hits for monomerid = 20681
Trg + Lig
Ki
nM
ΔG°
kcal/mole
IC50
nM
Kd
nM
EC50/IC50
nM
koff
s-1
kon
M-1s-1
pHTemp
°C
Thymidylate Synthase (TS)
(Escherichia coli)
BDBM20681
(2-amino-5-[(4-bromophenyl)methyl]-6-methyl-3H,4H,5...)
Show SMILES Cc1cc2nc(N)[nH]c(=O)c2n1Cc1ccc(Br)cc1
Show InChI InChI=1S/C14H13BrN4O/c1-8-6-11-12(13(20)18-14(16)17-11)19(8)7-9-2-4-10(15)5-3-9/h2-6H,7H2,1H3,(H3,16,17,18,20)
n/an/a 7.50E+3n/an/an/an/a7.430
Duquesne University
Assay Description
TS was assayed spectrophotometrically in the reaction buffer solution containing (6R, 6S)-5, 10-CH2H4folate. The reaction was initiated by the additi...
J Med Chem 51: 68-76 (2008)
Article DOI: 10.1021/jm701052u
BindingDB Entry DOI: 10.7270/Q2057D6N
Dihydrofolate reductase (DHFR)
(Toxoplasma gondii)
BDBM20681
(2-amino-5-[(4-bromophenyl)methyl]-6-methyl-3H,4H,5...)
Show SMILES Cc1cc2nc(N)[nH]c(=O)c2n1Cc1ccc(Br)cc1
Show InChI InChI=1S/C14H13BrN4O/c1-8-6-11-12(13(20)18-14(16)17-11)19(8)7-9-2-4-10(15)5-3-9/h2-6H,7H2,1H3,(H3,16,17,18,20)
n/an/a 1.80E+4n/an/an/an/an/an/a
Duquesne University
Assay Description
TS was assayed spectrophotometrically in the reaction buffer solution containing (6R, 6S)-5, 10-CH2H4folate. The reaction was initiated by the additi...
J Med Chem 51: 68-76 (2008)
Article DOI: 10.1021/jm701052u
BindingDB Entry DOI: 10.7270/Q2057D6N
Thymidylate synthase
(Homo sapiens (Human))
BDBM20681
(2-amino-5-[(4-bromophenyl)methyl]-6-methyl-3H,4H,5...)
Show SMILES Cc1cc2nc(N)[nH]c(=O)c2n1Cc1ccc(Br)cc1
Show InChI InChI=1S/C14H13BrN4O/c1-8-6-11-12(13(20)18-14(16)17-11)19(8)7-9-2-4-10(15)5-3-9/h2-6H,7H2,1H3,(H3,16,17,18,20)
NCI pathway
Reactome pathway
n/an/a 1.30E+3n/an/an/an/a7.430
Duquesne University
Assay Description
TS was assayed spectrophotometrically in the reaction buffer solution containing (6R, 6S)-5, 10-CH2H4folate. The reaction was initiated by the additi...
J Med Chem 51: 68-76 (2008)
Article DOI: 10.1021/jm701052u
BindingDB Entry DOI: 10.7270/Q2057D6N
Dihydrofolate Reductase (DHFR)
(Escherichia coli)
BDBM20681
(2-amino-5-[(4-bromophenyl)methyl]-6-methyl-3H,4H,5...)
Show SMILES Cc1cc2nc(N)[nH]c(=O)c2n1Cc1ccc(Br)cc1
Show InChI InChI=1S/C14H13BrN4O/c1-8-6-11-12(13(20)18-14(16)17-11)19(8)7-9-2-4-10(15)5-3-9/h2-6H,7H2,1H3,(H3,16,17,18,20)
n/an/a>3.00E+4n/an/an/an/an/an/a
Duquesne University
Assay Description
DHFRs were assayed spectrophotometrically in the reaction buffer solution containing dihydrofolate. The reaction was initiated with an amount of enzy...
J Med Chem 51: 68-76 (2008)
Article DOI: 10.1021/jm701052u
BindingDB Entry DOI: 10.7270/Q2057D6N
Dihydrofolate reductase (DHFR)
(Toxoplasma gondii)
BDBM20681
(2-amino-5-[(4-bromophenyl)methyl]-6-methyl-3H,4H,5...)
Show SMILES Cc1cc2nc(N)[nH]c(=O)c2n1Cc1ccc(Br)cc1
Show InChI InChI=1S/C14H13BrN4O/c1-8-6-11-12(13(20)18-14(16)17-11)19(8)7-9-2-4-10(15)5-3-9/h2-6H,7H2,1H3,(H3,16,17,18,20)
n/an/a 270n/an/an/an/an/an/a
Duquesne University
Assay Description
DHFRs were assayed spectrophotometrically in the reaction buffer solution containing dihydrofolate. The reaction was initiated with an amount of enzy...
J Med Chem 51: 68-76 (2008)
Article DOI: 10.1021/jm701052u
BindingDB Entry DOI: 10.7270/Q2057D6N
Dihydrofolate reductase
(Homo sapiens (Human))
BDBM20681
(2-amino-5-[(4-bromophenyl)methyl]-6-methyl-3H,4H,5...)
Show SMILES Cc1cc2nc(N)[nH]c(=O)c2n1Cc1ccc(Br)cc1
Show InChI InChI=1S/C14H13BrN4O/c1-8-6-11-12(13(20)18-14(16)17-11)19(8)7-9-2-4-10(15)5-3-9/h2-6H,7H2,1H3,(H3,16,17,18,20)
NCI pathway
Reactome pathway
n/an/a>3.50E+4n/an/an/an/an/an/a
Duquesne University
Assay Description
DHFRs were assayed spectrophotometrically in the reaction buffer solution containing dihydrofolate. The reaction was initiated with an amount of enzy...
J Med Chem 51: 68-76 (2008)
Article DOI: 10.1021/jm701052u
BindingDB Entry DOI: 10.7270/Q2057D6N