BDBM20725 (1R,2R)-2-{[4-(4-{[(4-cyanophenyl)carbamoyl]amino}phenyl)phenyl]carbonyl}cyclopentane-1-carboxylic acid::Urea-based Analogue, 4i
SMILES: OC(=O)[C@@H]1CCC[C@H]1C(=O)c1ccc(cc1)-c1ccc(NC(=O)Nc2ccc(cc2)C#N)cc1
InChI Key: InChIKey=FIXXEIAIMXXMQZ-DNQXCXABSA-N
Data: 2 IC50
Activity Spreadsheet -- Enzyme Inhibition Constant Data from BindingDB
Found 2 hits for monomerid = 20725
Trg + Lig
Ki
nM
ΔG°
kcal/mole
IC50
nM
Kd
nM
EC50/IC50
nM
koff
s-1
kon
M-1s-1
pHTemp
°C
Diacylglycerol O-acyltransferase 1
(Mus musculus (mouse))
BDBM20725
((1R,2R)-2-{[4-(4-{[(4-cyanophenyl)carbamoyl]amino}...)
Show SMILES OC(=O)[C@@H]1CCC[C@H]1C(=O)c1ccc(cc1)-c1ccc(NC(=O)Nc2ccc(cc2)C#N)cc1 |r|
Show InChI InChI=1S/C27H23N3O4/c28-16-17-4-12-21(13-5-17)29-27(34)30-22-14-10-19(11-15-22)18-6-8-20(9-7-18)25(31)23-2-1-3-24(23)26(32)33/h4-15,23-24H,1-3H2,(H,32,33)(H2,29,30,34)/t23-,24-/m1/s1
Reactome pathway
n/an/a 603n/an/an/an/a7.522
Abbott Laboratories
Assay Description
DGAT-1 activity was characterized by catalyzing the transfer of the radiolabeled decanoyl group onto the syn-3 position of didecanoyl glycerol. The r...
J Med Chem 51: 380-3 (2008)
Article DOI: 10.1021/jm7013887
BindingDB Entry DOI: 10.7270/Q2KW5DB6
Diacylglycerol O-acyltransferase 1 (DGAT1)
(Homo sapiens (Human))
BDBM20725
((1R,2R)-2-{[4-(4-{[(4-cyanophenyl)carbamoyl]amino}...)
Show SMILES OC(=O)[C@@H]1CCC[C@H]1C(=O)c1ccc(cc1)-c1ccc(NC(=O)Nc2ccc(cc2)C#N)cc1 |r|
Show InChI InChI=1S/C27H23N3O4/c28-16-17-4-12-21(13-5-17)29-27(34)30-22-14-10-19(11-15-22)18-6-8-20(9-7-18)25(31)23-2-1-3-24(23)26(32)33/h4-15,23-24H,1-3H2,(H,32,33)(H2,29,30,34)/t23-,24-/m1/s1
n/an/a 35n/an/an/an/a7.522
Abbott Laboratories
Assay Description
DGAT-1 activity was characterized by catalyzing the transfer of the radiolabeled decanoyl group onto the syn-3 position of didecanoyl glycerol. The r...
J Med Chem 51: 380-3 (2008)
Article DOI: 10.1021/jm7013887
BindingDB Entry DOI: 10.7270/Q2KW5DB6