BDBM20887 3-(5-chloro-2,4-dihydroxyphenyl)-N-ethyl-4-[4-(morpholin-4-ylmethyl)phenyl]-1H-pyrazole-5-carboxamide::Pyrazole, 19e
SMILES: CCNC(=O)c1[nH]nc(c1-c1ccc(CN2CCOCC2)cc1)-c1cc(Cl)c(O)cc1O
InChI Key: InChIKey=POHJRGFOMQYAJC-UHFFFAOYSA-N
Data: 1 IC50  1 EC50
Activity Spreadsheet -- Enzyme Inhibition Constant Data from BindingDB
Found 1 hit for monomerid = 20887
Trg + Lig
Ki
nM
ΔG°
kcal/mole
IC50
nM
Kd
nM
EC50/IC50
nM
koff
s-1
kon
M-1s-1
pHTemp
°C
Heat shock protein HSP 90-beta
(Homo sapiens (Human))
BDBM20887
(3-(5-chloro-2,4-dihydroxyphenyl)-N-ethyl-4-[4-(mor...)
Show SMILES CCNC(=O)c1[nH]nc(c1-c1ccc(CN2CCOCC2)cc1)-c1cc(Cl)c(O)cc1O
Show InChI InChI=1S/C23H25ClN4O4/c1-2-25-23(31)22-20(21(26-27-22)16-11-17(24)19(30)12-18(16)29)15-5-3-14(4-6-15)13-28-7-9-32-10-8-28/h3-6,11-12,29-30H,2,7-10,13H2,1H3,(H,25,31)(H,26,27)
Reactome pathway
n/an/a 37n/a 290n/an/a7.422
Vernalis (R&D) Ltd
Assay Description
The assay is based upon displacement of a fluorescently labeled molecule, which binds specifically to the ATP-binding site of full-length human Hsp90...
J Med Chem 51: 196-218 (2008)
Article DOI: 10.1021/jm701018h
BindingDB Entry DOI: 10.7270/Q2JW8C5C