BDBM20901 5-(5-chloro-2,4-dihydroxyphenyl)-N-ethyl-4-(4-{[(2-methanesulfonylethyl)amino]methyl}phenyl)-1,2-oxazole-3-carboxamide::Isoxazole, 30b::US10413550, Example 37::US9718793, 37
SMILES: CCNC(=O)c1noc(c1-c1ccc(CNCCS(C)(=O)=O)cc1)-c1cc(Cl)c(O)cc1O
InChI Key: InChIKey=HBZAMKDPZGODPV-UHFFFAOYSA-N
Data: 3 IC50  1 EC50
Activity Spreadsheet -- Enzyme Inhibition Constant Data from BindingDB
Found 3 hits for monomerid = 20901
Trg + Lig
Ki
nM
ΔG°
kcal/mole
IC50
nM
Kd
nM
EC50/IC50
nM
koff
s-1
kon
M-1s-1
pHTemp
°C
Heat shock protein HSP 90-beta
(Homo sapiens (Human))
BDBM20901
(5-(5-chloro-2,4-dihydroxyphenyl)-N-ethyl-4-(4-{[(2...)
Show SMILES CCNC(=O)c1noc(c1-c1ccc(CNCCS(C)(=O)=O)cc1)-c1cc(Cl)c(O)cc1O
Show InChI InChI=1S/C22H24ClN3O6S/c1-3-25-22(29)20-19(21(32-26-20)15-10-16(23)18(28)11-17(15)27)14-6-4-13(5-7-14)12-24-8-9-33(2,30)31/h4-7,10-11,24,27-28H,3,8-9,12H2,1-2H3,(H,25,29)
Reactome pathway
n/an/a 14n/a 1.98E+3n/an/a7.422
Vernalis (R&D) Ltd
Assay Description
The assay is based upon displacement of a fluorescently labeled molecule, which binds specifically to the ATP-binding site of full-length human Hsp90...
J Med Chem 51: 196-218 (2008)
Article DOI: 10.1021/jm701018h
BindingDB Entry DOI: 10.7270/Q2JW8C5C
HSP90
(Homo sapiens (Human)-Alligator mississippiensis (A...)
BDBM20901
(5-(5-chloro-2,4-dihydroxyphenyl)-N-ethyl-4-(4-{[(2...)
Show SMILES CCNC(=O)c1noc(c1-c1ccc(CNCCS(C)(=O)=O)cc1)-c1cc(Cl)c(O)cc1O
Show InChI InChI=1S/C22H24ClN3O6S/c1-3-25-22(29)20-19(21(32-26-20)15-10-16(23)18(28)11-17(15)27)14-6-4-13(5-7-14)12-24-8-9-33(2,30)31/h4-7,10-11,24,27-28H,3,8-9,12H2,1-2H3,(H,25,29)
Reactome pathway
US Patent
n/an/a<1.00E+4n/an/an/an/an/an/a
The Institute of Cancer Research
US Patent
Assay Description
(1) Greiner 384-well (Greiner 781101) or Costar 384-well flat-bottomed polystyrene multiwell plates (VWR). (2) Assay buffer of (a) 100 mM Tris...
US Patent US10413550 (2019)
BindingDB Entry DOI: 10.7270/Q2C82CP2
Heat shock protein HSP 90-alpha
(Homo sapiens (Human))
BDBM20901
(5-(5-chloro-2,4-dihydroxyphenyl)-N-ethyl-4-(4-{[(2...)
Show SMILES CCNC(=O)c1noc(c1-c1ccc(CNCCS(C)(=O)=O)cc1)-c1cc(Cl)c(O)cc1O
Show InChI InChI=1S/C22H24ClN3O6S/c1-3-25-22(29)20-19(21(32-26-20)15-10-16(23)18(28)11-17(15)27)14-6-4-13(5-7-14)12-24-8-9-33(2,30)31/h4-7,10-11,24,27-28H,3,8-9,12H2,1-2H3,(H,25,29)
NCI pathway
Reactome pathway
US Patent
n/an/a<1.00E+4n/an/an/an/an/an/a
Vernalis (R&D) Ltd.; Cancer Research Technology Limited; The Institute of Cancer Research
US Patent
Assay Description
Fluorescence polarization {also known as fluorescence anisotropy} measures the rotation of a fluorescing species in solution, where the larger molecu...
US Patent US9718793 (2017)
BindingDB Entry DOI: 10.7270/Q2SQ92DM