BDBM20906 5-(5-chloro-2,4-dihydroxyphenyl)-N-ethyl-4-{4-[(4-hydroxypiperidin-1-yl)methyl]phenyl}-1,2-oxazole-3-carboxamide::Isoxazole, 30i::US10413550, Example 53::US9718793, 53
SMILES: CCNC(=O)c1noc(c1-c1ccc(CN2CCC(O)CC2)cc1)-c1cc(Cl)c(O)cc1O
InChI Key: InChIKey=UXGROXSBDPYMIT-UHFFFAOYSA-N
Data: 3 IC50  1 EC50
Activity Spreadsheet -- Enzyme Inhibition Constant Data from BindingDB
Found 3 hits for monomerid = 20906
Trg + Lig
Ki
nM
ΔG°
kcal/mole
IC50
nM
Kd
nM
EC50/IC50
nM
koff
s-1
kon
M-1s-1
pHTemp
°C
Heat shock protein HSP 90-beta
(Homo sapiens (Human))
BDBM20906
(5-(5-chloro-2,4-dihydroxyphenyl)-N-ethyl-4-{4-[(4-...)
Show SMILES CCNC(=O)c1noc(c1-c1ccc(CN2CCC(O)CC2)cc1)-c1cc(Cl)c(O)cc1O
Show InChI InChI=1S/C24H26ClN3O5/c1-2-26-24(32)22-21(23(33-27-22)17-11-18(25)20(31)12-19(17)30)15-5-3-14(4-6-15)13-28-9-7-16(29)8-10-28/h3-6,11-12,16,29-31H,2,7-10,13H2,1H3,(H,26,32)
Reactome pathway
n/an/a 28n/a 1.29E+3n/an/a7.422
Vernalis (R&D) Ltd
Assay Description
The assay is based upon displacement of a fluorescently labeled molecule, which binds specifically to the ATP-binding site of full-length human Hsp90...
J Med Chem 51: 196-218 (2008)
Article DOI: 10.1021/jm701018h
BindingDB Entry DOI: 10.7270/Q2JW8C5C
HSP90
(Homo sapiens (Human)-Alligator mississippiensis (A...)
BDBM20906
(5-(5-chloro-2,4-dihydroxyphenyl)-N-ethyl-4-{4-[(4-...)
Show SMILES CCNC(=O)c1noc(c1-c1ccc(CN2CCC(O)CC2)cc1)-c1cc(Cl)c(O)cc1O
Show InChI InChI=1S/C24H26ClN3O5/c1-2-26-24(32)22-21(23(33-27-22)17-11-18(25)20(31)12-19(17)30)15-5-3-14(4-6-15)13-28-9-7-16(29)8-10-28/h3-6,11-12,16,29-31H,2,7-10,13H2,1H3,(H,26,32)
Reactome pathway
US Patent
n/an/a<1.00E+4n/an/an/an/an/an/a
The Institute of Cancer Research
US Patent
Assay Description
(1) Greiner 384-well (Greiner 781101) or Costar 384-well flat-bottomed polystyrene multiwell plates (VWR). (2) Assay buffer of (a) 100 mM Tris...
US Patent US10413550 (2019)
BindingDB Entry DOI: 10.7270/Q2C82CP2
Heat shock protein HSP 90-alpha
(Homo sapiens (Human))
BDBM20906
(5-(5-chloro-2,4-dihydroxyphenyl)-N-ethyl-4-{4-[(4-...)
Show SMILES CCNC(=O)c1noc(c1-c1ccc(CN2CCC(O)CC2)cc1)-c1cc(Cl)c(O)cc1O
Show InChI InChI=1S/C24H26ClN3O5/c1-2-26-24(32)22-21(23(33-27-22)17-11-18(25)20(31)12-19(17)30)15-5-3-14(4-6-15)13-28-9-7-16(29)8-10-28/h3-6,11-12,16,29-31H,2,7-10,13H2,1H3,(H,26,32)
NCI pathway
Reactome pathway
US Patent
n/an/a<1.00E+4n/an/an/an/an/an/a
Vernalis (R&D) Ltd.; Cancer Research Technology Limited; The Institute of Cancer Research
US Patent
Assay Description
Fluorescence polarization {also known as fluorescence anisotropy} measures the rotation of a fluorescing species in solution, where the larger molecu...
US Patent US9718793 (2017)
BindingDB Entry DOI: 10.7270/Q2SQ92DM