null
SMILES: OC(=O)c1nc(ccc1-c1cn(Cc2ccccc2)nn1)N1CCc2cccc(C(=O)Nc3nc4ccccc4s3)c2C1
InChI Key: InChIKey=QGEMJPBZSUHINL-UHFFFAOYSA-N
Activity Spreadsheet -- Enzyme Inhibition Constant Data from BindingDB
Found 4 hits for monomerid = 209176
Trg + Lig
Ki
nM
ΔG°
kcal/mole
IC50
nM
Kd
nM
EC50/IC50
nM
koff
s-1
kon
M-1s-1
pHTemp
°C
Bcl-2-like protein 1
(Homo sapiens (Human))
BDBM209176
(US9266877, 122)
Show SMILES OC(=O)c1nc(ccc1-c1cn(Cc2ccccc2)nn1)N1CCc2cccc(C(=O)Nc3nc4ccccc4s3)c2C1
Show InChI InChI=1S/C32H25N7O3S/c40-30(35-32-33-25-11-4-5-12-27(25)43-32)22-10-6-9-21-15-16-38(18-24(21)22)28-14-13-23(29(34-28)31(41)42)26-19-39(37-36-26)17-20-7-2-1-3-8-20/h1-14,19H,15-18H2,(H,41,42)(H,33,35,40)
NCI pathway
Reactome pathway
6n/an/an/an/an/an/an/an/a
TBA
Assay Description
Inhibition of F-Bak (GQVGRQLAIIGDK(6-FAM)INR-amide probe binding to BCL-xl (unknown origin) incubated for 1 hr by TR-FRET assay
Citation and Details
Article DOI: 10.1021/acsmedchemlett.9b00568
BindingDB Entry DOI: 10.7270/Q2542S8D
Bcl-2-like protein 1
(Homo sapiens (Human))
BDBM209176
(US9266877, 122)
Show SMILES OC(=O)c1nc(ccc1-c1cn(Cc2ccccc2)nn1)N1CCc2cccc(C(=O)Nc3nc4ccccc4s3)c2C1
Show InChI InChI=1S/C32H25N7O3S/c40-30(35-32-33-25-11-4-5-12-27(25)43-32)22-10-6-9-21-15-16-38(18-24(21)22)28-14-13-23(29(34-28)31(41)42)26-19-39(37-36-26)17-20-7-2-1-3-8-20/h1-14,19H,15-18H2,(H,41,42)(H,33,35,40)
NCI pathway
Reactome pathway
US Patent
117 -9.45n/an/an/an/an/an/a25
ABBVIE INC.
US Patent
Assay Description
The measurement of competition of compounds of Formula (I) with F-Bak for a Bcl-2 family protein (Bcl-xL) binding site using a Time Resolved Fluoresc...
US Patent US9266877 (2016)
BindingDB Entry DOI: 10.7270/Q2H41Q7V
Apoptosis regulator Bcl-2
(Homo sapiens (Human))
BDBM209176
(US9266877, 122)
Show SMILES OC(=O)c1nc(ccc1-c1cn(Cc2ccccc2)nn1)N1CCc2cccc(C(=O)Nc3nc4ccccc4s3)c2C1
Show InChI InChI=1S/C32H25N7O3S/c40-30(35-32-33-25-11-4-5-12-27(25)43-32)22-10-6-9-21-15-16-38(18-24(21)22)28-14-13-23(29(34-28)31(41)42)26-19-39(37-36-26)17-20-7-2-1-3-8-20/h1-14,19H,15-18H2,(H,41,42)(H,33,35,40)
348n/an/an/an/an/an/an/an/a
TBA
Assay Description
Inhibition of F-Bak (GQVGRQLAIIGDK(6-FAM)INR-amide) F-Bak(GQVGRQLAIIGDK(6-FAM)INR-amide) binding to BCL2 (unknown origin) incubated for 1 hr by TR-FR...
Citation and Details
Article DOI: 10.1021/acsmedchemlett.9b00568
BindingDB Entry DOI: 10.7270/Q2542S8D
Bcl-2-like protein 1
(Mus musculus (Mouse))
BDBM209176
(US9266877, 122)
Show SMILES OC(=O)c1nc(ccc1-c1cn(Cc2ccccc2)nn1)N1CCc2cccc(C(=O)Nc3nc4ccccc4s3)c2C1
Show InChI InChI=1S/C32H25N7O3S/c40-30(35-32-33-25-11-4-5-12-27(25)43-32)22-10-6-9-21-15-16-38(18-24(21)22)28-14-13-23(29(34-28)31(41)42)26-19-39(37-36-26)17-20-7-2-1-3-8-20/h1-14,19H,15-18H2,(H,41,42)(H,33,35,40)
US Patent
n/an/an/an/a>1.00E+3n/an/an/an/a
ABBVIE INC.
US Patent
Assay Description
The efficacy of the compounds of Formula (I) can also be determined in cell-based killing assays using a variety of cell lines and mouse tumor models...
US Patent US9266877 (2016)
BindingDB Entry DOI: 10.7270/Q2H41Q7V