BDBM21089 3-[4-(3-amino-1,2-benzoxazol-4-yl)phenyl]-1-(3-chlorophenyl)urea::Aminobenzoisoxazole, 32
SMILES: Nc1noc2cccc(-c3ccc(NC(=O)Nc4cccc(Cl)c4)cc3)c12
InChI Key: InChIKey=KENMZDPHYLZVEW-UHFFFAOYSA-N
Data: 3 IC50  1 EC50
Activity Spreadsheet -- Enzyme Inhibition Constant Data from BindingDB
Found 3 hits for monomerid = 21089
Trg + Lig
Ki
nM
ΔG°
kcal/mole
IC50
nM
Kd
nM
EC50/IC50
nM
koff
s-1
kon
M-1s-1
pHTemp
°C
Mast/stem cell growth factor receptor Kit
(Homo sapiens (Human))
BDBM21089
(3-[4-(3-amino-1,2-benzoxazol-4-yl)phenyl]-1-(3-chl...)
Show SMILES Nc1noc2cccc(-c3ccc(NC(=O)Nc4cccc(Cl)c4)cc3)c12
Show InChI InChI=1S/C20H15ClN4O2/c21-13-3-1-4-15(11-13)24-20(26)23-14-9-7-12(8-10-14)16-5-2-6-17-18(16)19(22)25-27-17/h1-11H,(H2,22,25)(H2,23,24,26)
n/an/a 10n/an/an/an/an/an/a
Abbott Laboratories
Assay Description
The assay uses purified enzyme interacting with biotinylated peptide substrate. HTRF is based on the proximity of europium cryptate (donor fluorophor...
J Med Chem 51: 1231-41 (2008)
Article DOI: 10.1021/jm701096v
BindingDB Entry DOI: 10.7270/Q2HX19Z7
Vascular endothelial growth factor receptor 2
(Homo sapiens (Human))
BDBM21089
(3-[4-(3-amino-1,2-benzoxazol-4-yl)phenyl]-1-(3-chl...)
Show SMILES Nc1noc2cccc(-c3ccc(NC(=O)Nc4cccc(Cl)c4)cc3)c12
Show InChI InChI=1S/C20H15ClN4O2/c21-13-3-1-4-15(11-13)24-20(26)23-14-9-7-12(8-10-14)16-5-2-6-17-18(16)19(22)25-27-17/h1-11H,(H2,22,25)(H2,23,24,26)
NCI pathway
Reactome pathway
n/an/a 8n/a 28n/an/a7.522
Abbott Laboratories
Assay Description
The assay uses purified enzyme interacting with biotinylated peptide substrate. HTRF is based on the proximity of europium cryptate (donor fluorophor...
J Med Chem 51: 1231-41 (2008)
Article DOI: 10.1021/jm701096v
BindingDB Entry DOI: 10.7270/Q2HX19Z7
Cytochrome P450 19A1
(Homo sapiens (Human))
BDBM21089
(3-[4-(3-amino-1,2-benzoxazol-4-yl)phenyl]-1-(3-chl...)
Show SMILES Nc1noc2cccc(-c3ccc(NC(=O)Nc4cccc(Cl)c4)cc3)c12
Show InChI InChI=1S/C20H15ClN4O2/c21-13-3-1-4-15(11-13)24-20(26)23-14-9-7-12(8-10-14)16-5-2-6-17-18(16)19(22)25-27-17/h1-11H,(H2,22,25)(H2,23,24,26)
Reactome pathway
n/an/a 6n/an/an/an/an/an/a
Abbott Laboratories
Assay Description
The assay uses purified enzyme interacting with biotinylated peptide substrate. HTRF is based on the proximity of europium cryptate (donor fluorophor...
J Med Chem 51: 1231-41 (2008)
Article DOI: 10.1021/jm701096v
BindingDB Entry DOI: 10.7270/Q2HX19Z7