BDBM21092 3-[4-(3-amino-1,2-benzoxazol-4-yl)phenyl]-1-(4-methoxyphenyl)urea::Aminobenzoisoxazole, 35
SMILES: COc1ccc(NC(=O)Nc2ccc(cc2)-c2cccc3onc(N)c23)cc1
InChI Key: InChIKey=XEEJFCRYWIMJSK-UHFFFAOYSA-N
Data: 2 IC50  1 EC50
Activity Spreadsheet -- Enzyme Inhibition Constant Data from BindingDB
Found 2 hits for monomerid = 21092
Trg + Lig
Ki
nM
ΔG°
kcal/mole
IC50
nM
Kd
nM
EC50/IC50
nM
koff
s-1
kon
M-1s-1
pHTemp
°C
Vascular endothelial growth factor receptor 2
(Homo sapiens (Human))
BDBM21092
(3-[4-(3-amino-1,2-benzoxazol-4-yl)phenyl]-1-(4-met...)
Show SMILES COc1ccc(NC(=O)Nc2ccc(cc2)-c2cccc3onc(N)c23)cc1
Show InChI InChI=1S/C21H18N4O3/c1-27-16-11-9-15(10-12-16)24-21(26)23-14-7-5-13(6-8-14)17-3-2-4-18-19(17)20(22)25-28-18/h2-12H,1H3,(H2,22,25)(H2,23,24,26)
NCI pathway
Reactome pathway
n/an/a 22n/a 106n/an/a7.522
Abbott Laboratories
Assay Description
The assay uses purified enzyme interacting with biotinylated peptide substrate. HTRF is based on the proximity of europium cryptate (donor fluorophor...
J Med Chem 51: 1231-41 (2008)
Article DOI: 10.1021/jm701096v
BindingDB Entry DOI: 10.7270/Q2HX19Z7
Mast/stem cell growth factor receptor Kit
(Homo sapiens (Human))
BDBM21092
(3-[4-(3-amino-1,2-benzoxazol-4-yl)phenyl]-1-(4-met...)
Show SMILES COc1ccc(NC(=O)Nc2ccc(cc2)-c2cccc3onc(N)c23)cc1
Show InChI InChI=1S/C21H18N4O3/c1-27-16-11-9-15(10-12-16)24-21(26)23-14-7-5-13(6-8-14)17-3-2-4-18-19(17)20(22)25-28-18/h2-12H,1H3,(H2,22,25)(H2,23,24,26)
n/an/a 5n/an/an/an/an/an/a
Abbott Laboratories
Assay Description
The assay uses purified enzyme interacting with biotinylated peptide substrate. HTRF is based on the proximity of europium cryptate (donor fluorophor...
J Med Chem 51: 1231-41 (2008)
Article DOI: 10.1021/jm701096v
BindingDB Entry DOI: 10.7270/Q2HX19Z7