BDBM21096 3-[4-(3-amino-1,2-benzoxazol-4-yl)phenyl]-1-[2-fluoro-5-(trifluoromethyl)phenyl]urea::Aminobenzoisoxazole, 39
SMILES: Nc1noc2cccc(-c3ccc(NC(=O)Nc4cc(ccc4F)C(F)(F)F)cc3)c12
InChI Key: InChIKey=DHSKSBMVWDEGIA-UHFFFAOYSA-N
Data: 3 IC50  1 EC50
Activity Spreadsheet -- Enzyme Inhibition Constant Data from BindingDB
Found 3 hits for monomerid = 21096
Trg + Lig
Ki
nM
ΔG°
kcal/mole
IC50
nM
Kd
nM
EC50/IC50
nM
koff
s-1
kon
M-1s-1
pHTemp
°C
Mast/stem cell growth factor receptor Kit
(Homo sapiens (Human))
BDBM21096
(3-[4-(3-amino-1,2-benzoxazol-4-yl)phenyl]-1-[2-flu...)
Show SMILES Nc1noc2cccc(-c3ccc(NC(=O)Nc4cc(ccc4F)C(F)(F)F)cc3)c12
Show InChI InChI=1S/C21H14F4N4O2/c22-15-9-6-12(21(23,24)25)10-16(15)28-20(30)27-13-7-4-11(5-8-13)14-2-1-3-17-18(14)19(26)29-31-17/h1-10H,(H2,26,29)(H2,27,28,30)
n/an/a 339n/an/an/an/an/an/a
Abbott Laboratories
Assay Description
The assay uses purified enzyme interacting with biotinylated peptide substrate. HTRF is based on the proximity of europium cryptate (donor fluorophor...
J Med Chem 51: 1231-41 (2008)
Article DOI: 10.1021/jm701096v
BindingDB Entry DOI: 10.7270/Q2HX19Z7
Vascular endothelial growth factor receptor 2
(Homo sapiens (Human))
BDBM21096
(3-[4-(3-amino-1,2-benzoxazol-4-yl)phenyl]-1-[2-flu...)
Show SMILES Nc1noc2cccc(-c3ccc(NC(=O)Nc4cc(ccc4F)C(F)(F)F)cc3)c12
Show InChI InChI=1S/C21H14F4N4O2/c22-15-9-6-12(21(23,24)25)10-16(15)28-20(30)27-13-7-4-11(5-8-13)14-2-1-3-17-18(14)19(26)29-31-17/h1-10H,(H2,26,29)(H2,27,28,30)
NCI pathway
Reactome pathway
n/an/a 104n/a 80n/an/a7.522
Abbott Laboratories
Assay Description
The assay uses purified enzyme interacting with biotinylated peptide substrate. HTRF is based on the proximity of europium cryptate (donor fluorophor...
J Med Chem 51: 1231-41 (2008)
Article DOI: 10.1021/jm701096v
BindingDB Entry DOI: 10.7270/Q2HX19Z7
Cytochrome P450 19A1
(Homo sapiens (Human))
BDBM21096
(3-[4-(3-amino-1,2-benzoxazol-4-yl)phenyl]-1-[2-flu...)
Show SMILES Nc1noc2cccc(-c3ccc(NC(=O)Nc4cc(ccc4F)C(F)(F)F)cc3)c12
Show InChI InChI=1S/C21H14F4N4O2/c22-15-9-6-12(21(23,24)25)10-16(15)28-20(30)27-13-7-4-11(5-8-13)14-2-1-3-17-18(14)19(26)29-31-17/h1-10H,(H2,26,29)(H2,27,28,30)
Reactome pathway
n/an/a 213n/an/an/an/an/an/a
Abbott Laboratories
Assay Description
The assay uses purified enzyme interacting with biotinylated peptide substrate. HTRF is based on the proximity of europium cryptate (donor fluorophor...
J Med Chem 51: 1231-41 (2008)
Article DOI: 10.1021/jm701096v
BindingDB Entry DOI: 10.7270/Q2HX19Z7