null
SMILES: OC(=O)CN1C(=O)C2(CC(=O)N(Cc3cccc(Cl)c3)C2=O)c2cc(Cl)ccc12
InChI Key: InChIKey=PTGHDUZXAIHWGN-UHFFFAOYSA-N
Activity Spreadsheet -- Enzyme Inhibition Constant Data from BindingDB
Found 1 hit for monomerid = 21568
Trg + Lig
Ki
nM
ΔG°
kcal/mole
IC50
nM
Kd
nM
EC50/IC50
nM
koff
s-1
kon
M-1s-1
pHTemp
°C
Prostaglandin D2 receptor 2
(Homo sapiens (Human))
BDBM21568
(2-{5-chloro-1'-[(3-chlorophenyl)methyl]-1,2-dihydr...)
Show SMILES OC(=O)CN1C(=O)C2(CC(=O)N(Cc3cccc(Cl)c3)C2=O)c2cc(Cl)ccc12
Show InChI InChI=1S/C20H14Cl2N2O5/c21-12-3-1-2-11(6-12)9-24-16(25)8-20(19(24)29)14-7-13(22)4-5-15(14)23(18(20)28)10-17(26)27/h1-7H,8-10H2,(H,26,27)
Reactome pathway
68 -9.67n/an/a 122n/an/a7.422
Merck Serono
Assay Description
A scintillation proximity assay was used for radioligand competition and saturation binding assays. Nonspecific binding was determined in the presenc...
J Med Chem 51: 2227-2243 (2008)
Article DOI: 10.1021/jm701383e
BindingDB Entry DOI: 10.7270/Q22R3PZS