null
SMILES: COc1cccc(OCCCOc2ccc3[C@H](CC(O)=O)CCc3c2)c1
InChI Key: InChIKey=MAXOZDRPHKQHJD-INIZCTEOSA-N
Activity Spreadsheet -- Enzyme Inhibition Constant Data from BindingDB
Found 3 hits for monomerid = 21764
Trg + Lig
Ki
nM
ΔG°
kcal/mole
IC50
nM
Kd
nM
EC50/IC50
nM
koff
s-1
kon
M-1s-1
pHTemp
°C
Peroxisome proliferator-activated receptor alpha
(Homo sapiens (Human))
BDBM21764
(2-[(1S)-5-[3-(3-methoxyphenoxy)propoxy]-2,3-dihydr...)
Show SMILES COc1cccc(OCCCOc2ccc3[C@H](CC(O)=O)CCc3c2)c1 |r|
Show InChI InChI=1S/C21H24O5/c1-24-17-4-2-5-18(14-17)25-10-3-11-26-19-8-9-20-15(12-19)6-7-16(20)13-21(22)23/h2,4-5,8-9,12,14,16H,3,6-7,10-11,13H2,1H3,(H,22,23)/t16-/m0/s1
n/an/an/an/a>1.00E+4n/an/a7.422
Bayer HealthCare Pharmaceuticals Corporation
Assay Description
Activity was assessed by measuring the human PPAR ligand binding domain with the co-activator protein. Europium labeled anti-GST antibody, streptavid...
J Med Chem 50: 984-1000 (2007)
Article DOI: 10.1021/jm061299k
BindingDB Entry DOI: 10.7270/Q2NK3C93
Peroxisome proliferator-activated receptor delta
(Homo sapiens (Human))
BDBM21764
(2-[(1S)-5-[3-(3-methoxyphenoxy)propoxy]-2,3-dihydr...)
Show SMILES COc1cccc(OCCCOc2ccc3[C@H](CC(O)=O)CCc3c2)c1 |r|
Show InChI InChI=1S/C21H24O5/c1-24-17-4-2-5-18(14-17)25-10-3-11-26-19-8-9-20-15(12-19)6-7-16(20)13-21(22)23/h2,4-5,8-9,12,14,16H,3,6-7,10-11,13H2,1H3,(H,22,23)/t16-/m0/s1
n/an/an/an/a 8.55E+6n/an/an/an/a
TBA
Assay Description
Agonist activity at GST-tagged Homo sapiens (human) PPARdelta ligand binding domain after 2 hr by FRET assay
Citation and Details
Article DOI: 10.1007/s00044-011-9599-z
BindingDB Entry DOI: 10.7270/Q22J6FR8
Peroxisome proliferator-activated receptor delta
(Homo sapiens (Human))
BDBM21764
(2-[(1S)-5-[3-(3-methoxyphenoxy)propoxy]-2,3-dihydr...)
Show SMILES COc1cccc(OCCCOc2ccc3[C@H](CC(O)=O)CCc3c2)c1 |r|
Show InChI InChI=1S/C21H24O5/c1-24-17-4-2-5-18(14-17)25-10-3-11-26-19-8-9-20-15(12-19)6-7-16(20)13-21(22)23/h2,4-5,8-9,12,14,16H,3,6-7,10-11,13H2,1H3,(H,22,23)/t16-/m0/s1
n/an/an/an/a 117n/an/an/a25
Bayer HealthCare Pharmaceuticals Corporation
Assay Description
Activity was assessed by measuring the human PPAR ligand binding domain with the co-activator protein. Europium labeled anti-GST antibody, streptavid...
J Med Chem 50: 984-1000 (2007)
Article DOI: 10.1021/jm061299k
BindingDB Entry DOI: 10.7270/Q2NK3C93